{"text_format":"1","workbook":"xlsx","n_sheets":4,"sheets":["Calculation","Parameter","Calendar","Disclaimer"],"not_rendered":{"charts":0,"images":1,"macros":1,"external_links":1,"defined_names":60,"comments":0,"pivot_tables":0},"unopened":[],"bounds":{"document_bytes":16777216,"sheet_cells":100000,"rows_first":2000,"rows_last":500,"rows_between":2000,"halvings":0,"cell_chars":16384,"cell_head_chars":4096},"cells_cut":0,"cells_raw":0,"read":"whole","date_system":"1900"}

{"sheet":"Calculation","index":0,"n_rows":510,"n_cols":14,"rows_kept":510,"cut":false,"hidden":false,"merged":[[5,3,5,4],[4,3,4,7]]}
[]
[]
[null,null,null,null,null,null,"With Holiday Adjustment?","YES","standard: YES"]
[]
[null,null,null,"IMSM Margin Calculator Example V 3.1.0"]
[null,null,null,"valid from: 2023-08-16"]
[]
[]
[]
["Date","Exposure","T0Exposure",{"$f":"\"Exposure > \" & minIMSM & \" EUR\"","v":"Exposure > 0 EUR"},{"$f":"\"T0Exposure > \" & minIMSM & \" EUR\"","v":"T0Exposure > 0 EUR"},"Mean","Standard Deviation (SD)","Number of datapoints","SD with Securityfactor (SDS)","Mean + alpha * SDS","beta * Max (T-30 to T)","Scaling Factor\n(Holiday Adjustment)","IMSM Requirement"]
[{"$f":"IF($A$12=\"\",\"\",OFFSET(Calendar!$A$1,VLOOKUP(Calculation!$A$12,Calendar!$A$2:$C$1306,2,FALSE)+1,0))","v":"2022-03-24"},null,null,null,{"$f":"IF(C11>minIMSM,C11,\"\")","v":""},{"$f":"IF($A11=\"\",\"\",IFERROR((AVERAGE(E12,INDIRECT(\"D\" & ROW(A13) & \":D\" &  ROW(A13) + window_size-2))),0))","v":883471.36915887846},563305.9666573432,214,603452.49612906459,{"$f":"IF($A11=\"\",\"\",F11+alpha*I11)","v":2030031.1118041012},{"$f":"IF($A11=\"\",\"\",beta*MAX(E12,INDIRECT(\"B\" & ROW(A13) & \":B\" &  ROW(A13) + window_size_max-2)))","v":4444297.6000000006},{"$f":"IF($A12=\"\",\"\",IF($H$3=\"YES\",VLOOKUP(OFFSET(A12,N11,0),Calendar!$A$2:$C$10000,3,FALSE),1))","v":1},{"$f":"IF(A12=\"\",\"\",IF(VLOOKUP(A11,Calendar!A:E,5,FALSE)=0,\"\",CEILING(L11*CEILING(MAX(OFFSET(K11,N11,0),OFFSET(J11,N11,0)),roundto),roundto)+add_margin))","v":4500000},{"$f":"IF(INDIRECT(\"Calendar!E\"&MATCH($A11,Calendar!A:A,0)-1),0,IF(INDIRECT(\"Calendar!E\"&MATCH($A11,Calendar!A:A,0)-2),1,2))","v":0}]
["2022-03-23",323440,240947,{"$f":"IF(B12>minIMSM,B12,\"\")","v":323440},240947,{"$f":"IF($A12=\"\",\"\",IFERROR((AVERAGE(E13,INDIRECT(\"D\" & ROW(A14) & \":D\" &  ROW(A14) + window_size-2))),0))","v":882945.80841121497},564454.88230294641,214,604683.2944078315,2031844.0677860947,4444297.6000000006,{"$f":"IF($A13=\"\",\"\",IF($H$3=\"YES\",VLOOKUP(OFFSET(A13,N12,0),Calendar!$A$2:$C$10000,3,FALSE),1))","v":1},{"$f":"IF(A13=\"\",\"\",IF(VLOOKUP(A12,Calendar!A:E,5,FALSE)=0,\"\",CEILING(L12*CEILING(MAX(OFFSET(K12,N12,0),OFFSET(J12,N12,0)),roundto),roundto)+add_margin))","v":4500000},{"$f":"IF(INDIRECT(\"Calendar!E\"&MATCH($A12,Calendar!A:A,0)-1),0,IF(INDIRECT(\"Calendar!E\"&MATCH($A12,Calendar!A:A,0)-2),1,2))","v":0}]
["2022-03-22",566967,326020,566967,326020,886098.13084112154,567824.86169251997,214,608293.45051288605,2041855.686815605,4444297.6000000006,{"$f":"IF($A14=\"\",\"\",IF($H$3=\"YES\",VLOOKUP(OFFSET(A14,N13,0),Calendar!$A$2:$C$10000,3,FALSE),1))","v":1},{"$f":"IF(A14=\"\",\"\",IF(VLOOKUP(A13,Calendar!A:E,5,FALSE)=0,\"\",CEILING(L13*CEILING(MAX(OFFSET(K13,N13,0),OFFSET(J13,N13,0)),roundto),roundto)+add_margin))","v":4500000},{"$f":"IF(INDIRECT(\"Calendar!E\"&MATCH($A13,Calendar!A:A,0)-1),0,IF(INDIRECT(\"Calendar!E\"&MATCH($A13,Calendar!A:A,0)-2),1,2))","v":0}]
["2022-03-21",340789,56745,340789,56745,887080.98139534879,567655.77741018299,215,607965.1591291629,2042214.7837407584,4444297.6000000006,{"$f":"IF($A15=\"\",\"\",IF($H$3=\"YES\",VLOOKUP(OFFSET(A15,N14,0),Calendar!$A$2:$C$10000,3,FALSE),1))","v":1},{"$f":"IF(A15=\"\",\"\",IF(VLOOKUP(A14,Calendar!A:E,5,FALSE)=0,\"\",CEILING(L14*CEILING(MAX(OFFSET(K14,N14,0),OFFSET(J14,N14,0)),roundto),roundto)+add_margin))","v":4500000},{"$f":"IF(INDIRECT(\"Calendar!E\"&MATCH($A14,Calendar!A:A,0)-1),0,IF(INDIRECT(\"Calendar!E\"&MATCH($A14,Calendar!A:A,0)-2),1,2))","v":0}]
["2022-03-18",-3109,40545,"",40545,888625.07441860461,563442.80349904834,215,603453.02086471044,2035185.8140615544,4444297.6000000006,{"$f":"IF($A16=\"\",\"\",IF($H$3=\"YES\",VLOOKUP(OFFSET(A16,N15,0),Calendar!$A$2:$C$10000,3,FALSE),1))","v":1},{"$f":"IF(A16=\"\",\"\",IF(VLOOKUP(A15,Calendar!A:E,5,FALSE)=0,\"\",CEILING(L15*CEILING(MAX(OFFSET(K15,N15,0),OFFSET(J15,N15,0)),roundto),roundto)+add_margin))","v":4500000},{"$f":"IF(INDIRECT(\"Calendar!E\"&MATCH($A15,Calendar!A:A,0)-1),0,IF(INDIRECT(\"Calendar!E\"&MATCH($A15,Calendar!A:A,0)-2),1,2))","v":0}]
["2022-03-17",1015000,1029335,1015000,1029335,881563.49302325584,570761.72444685607,215,611291.66025809129,2043017.6475136292,4444297.6000000006,{"$f":"IF($A17=\"\",\"\",IF($H$3=\"YES\",VLOOKUP(OFFSET(A17,N16,0),Calendar!$A$2:$C$10000,3,FALSE),1))","v":1},{"$f":"IF(A17=\"\",\"\",IF(VLOOKUP(A16,Calendar!A:E,5,FALSE)=0,\"\",CEILING(L16*CEILING(MAX(OFFSET(K16,N16,0),OFFSET(J16,N16,0)),roundto),roundto)+add_margin))","v":4500000},{"$f":"IF(INDIRECT(\"Calendar!E\"&MATCH($A16,Calendar!A:A,0)-1),0,IF(INDIRECT(\"Calendar!E\"&MATCH($A16,Calendar!A:A,0)-2),1,2))","v":0}]
["2022-03-16",1121777,252812,1121777,252812,881088.97209302324,567297.91476235515,215,607581.88456332369,2035494.5527633382,4444297.6000000006,{"$f":"IF($A18=\"\",\"\",IF($H$3=\"YES\",VLOOKUP(OFFSET(A18,N17,0),Calendar!$A$2:$C$10000,3,FALSE),1))","v":1},{"$f":"IF(A18=\"\",\"\",IF(VLOOKUP(A17,Calendar!A:E,5,FALSE)=0,\"\",CEILING(L17*CEILING(MAX(OFFSET(K17,N17,0),OFFSET(J17,N17,0)),roundto),roundto)+add_margin))","v":4500000},{"$f":"IF(INDIRECT(\"Calendar!E\"&MATCH($A17,Calendar!A:A,0)-1),0,IF(INDIRECT(\"Calendar!E\"&MATCH($A17,Calendar!A:A,0)-2),1,2))","v":0}]
["2022-03-15",2167612,2048958,2167612,2048958,865846.07441860461,520192.51223230507,215,557131.5153700735,1924395.9536217442,2520105.6,{"$f":"IF($A19=\"\",\"\",IF($H$3=\"YES\",VLOOKUP(OFFSET(A19,N18,0),Calendar!$A$2:$C$10000,3,FALSE),1))","v":1},{"$f":"IF(A19=\"\",\"\",IF(VLOOKUP(A18,Calendar!A:E,5,FALSE)=0,\"\",CEILING(L18*CEILING(MAX(OFFSET(K18,N18,0),OFFSET(J18,N18,0)),roundto),roundto)+add_margin))","v":2580000},{"$f":"IF(INDIRECT(\"Calendar!E\"&MATCH($A18,Calendar!A:A,0)-1),0,IF(INDIRECT(\"Calendar!E\"&MATCH($A18,Calendar!A:A,0)-2),1,2))","v":0}]
["2022-03-14",2777686,861622,2777686,861622,861613.36279069772,524586.040625002,215,561837.02933593304,1929103.7185289704,2783016,{"$f":"IF($A20=\"\",\"\",IF($H$3=\"YES\",VLOOKUP(OFFSET(A20,N19,0),Calendar!$A$2:$C$10000,3,FALSE),1))","v":1},{"$f":"IF(A20=\"\",\"\",IF(VLOOKUP(A19,Calendar!A:E,5,FALSE)=0,\"\",CEILING(L19*CEILING(MAX(OFFSET(K19,N19,0),OFFSET(J19,N19,0)),roundto),roundto)+add_margin))","v":2840000},{"$f":"IF(INDIRECT(\"Calendar!E\"&MATCH($A19,Calendar!A:A,0)-1),0,IF(INDIRECT(\"Calendar!E\"&MATCH($A19,Calendar!A:A,0)-2),1,2))","v":0}]
["2022-03-11",1149197,421528,1149197,421528,861285.72558139532,523582.20445731631,215,560761.91050562542,1926733.3555420837,2783016,{"$f":"IF($A21=\"\",\"\",IF($H$3=\"YES\",VLOOKUP(OFFSET(A21,N20,0),Calendar!$A$2:$C$10000,3,FALSE),1))","v":1},{"$f":"IF(A21=\"\",\"\",IF(VLOOKUP(A20,Calendar!A:E,5,FALSE)=0,\"\",CEILING(L20*CEILING(MAX(OFFSET(K20,N20,0),OFFSET(J20,N20,0)),roundto),roundto)+add_margin))","v":2840000},{"$f":"IF(INDIRECT(\"Calendar!E\"&MATCH($A20,Calendar!A:A,0)-1),0,IF(INDIRECT(\"Calendar!E\"&MATCH($A20,Calendar!A:A,0)-2),1,2))","v":0}]
["2022-03-10",1257405,935896,1257405,935896,856982.76744186052,525662.72500511503,215,562990.16934883618,1926664.089204649,2783016,{"$f":"IF($A22=\"\",\"\",IF($H$3=\"YES\",VLOOKUP(OFFSET(A22,N21,0),Calendar!$A$2:$C$10000,3,FALSE),1))","v":1},{"$f":"IF(A22=\"\",\"\",IF(VLOOKUP(A21,Calendar!A:E,5,FALSE)=0,\"\",CEILING(L21*CEILING(MAX(OFFSET(K21,N21,0),OFFSET(J21,N21,0)),roundto),roundto)+add_margin))","v":2840000},{"$f":"IF(INDIRECT(\"Calendar!E\"&MATCH($A21,Calendar!A:A,0)-1),0,IF(INDIRECT(\"Calendar!E\"&MATCH($A21,Calendar!A:A,0)-2),1,2))","v":0}]
["2022-03-09",1248066,628424,1248066,628424,852287.02790697676,529210.43425764481,215,566789.80234138423,1929187.6523556067,2783016,{"$f":"IF($A23=\"\",\"\",IF($H$3=\"YES\",VLOOKUP(OFFSET(A23,N22,0),Calendar!$A$2:$C$10000,3,FALSE),1))","v":1},{"$f":"IF(A23=\"\",\"\",IF(VLOOKUP(A22,Calendar!A:E,5,FALSE)=0,\"\",CEILING(L22*CEILING(MAX(OFFSET(K22,N22,0),OFFSET(J22,N22,0)),roundto),roundto)+add_margin))","v":2840000},{"$f":"IF(INDIRECT(\"Calendar!E\"&MATCH($A22,Calendar!A:A,0)-1),0,IF(INDIRECT(\"Calendar!E\"&MATCH($A22,Calendar!A:A,0)-2),1,2))","v":0}]
["2022-03-08",1102410,548039,{"$f":"IF(B23>minIMSM,B23,\"\")","v":1102410},548039,848978.56279069767,537321.84085751954,215,575477.20199536637,1942385.2465818936,2783016,{"$f":"IF($A24=\"\",\"\",IF($H$3=\"YES\",VLOOKUP(OFFSET(A24,N23,0),Calendar!$A$2:$C$10000,3,FALSE),1))","v":1},{"$f":"IF(A24=\"\",\"\",IF(VLOOKUP(A23,Calendar!A:E,5,FALSE)=0,\"\",CEILING(L23*CEILING(MAX(OFFSET(K23,N23,0),OFFSET(J23,N23,0)),roundto),roundto)+add_margin))","v":2840000},{"$f":"IF(INDIRECT(\"Calendar!E\"&MATCH($A23,Calendar!A:A,0)-1),0,IF(INDIRECT(\"Calendar!E\"&MATCH($A23,Calendar!A:A,0)-2),1,2))","v":0}]
["2022-03-07",453305,19400,453305,19400,851415.93488372094,531557.51870538178,215,569303.55385514174,1933092.6872084902,2783016,{"$f":"IF($A25=\"\",\"\",IF($H$3=\"YES\",VLOOKUP(OFFSET(A25,N24,0),Calendar!$A$2:$C$10000,3,FALSE),1))","v":1},{"$f":"IF(A25=\"\",\"\",IF(VLOOKUP(A24,Calendar!A:E,5,FALSE)=0,\"\",CEILING(L24*CEILING(MAX(OFFSET(K24,N24,0),OFFSET(J24,N24,0)),roundto),roundto)+add_margin))","v":2840000},{"$f":"IF(INDIRECT(\"Calendar!E\"&MATCH($A24,Calendar!A:A,0)-1),0,IF(INDIRECT(\"Calendar!E\"&MATCH($A24,Calendar!A:A,0)-2),1,2))","v":0}]
["2022-03-04",293583,388371,293583,388371,850887.40930232557,533607.52574178728,215,571499.13241472282,1936735.760890299,2783016,{"$f":"IF($A26=\"\",\"\",IF($H$3=\"YES\",VLOOKUP(OFFSET(A26,N25,0),Calendar!$A$2:$C$10000,3,FALSE),1))","v":1},{"$f":"IF(A26=\"\",\"\",IF(VLOOKUP(A25,Calendar!A:E,5,FALSE)=0,\"\",CEILING(L25*CEILING(MAX(OFFSET(K25,N25,0),OFFSET(J25,N25,0)),roundto),roundto)+add_margin))","v":2840000},{"$f":"IF(INDIRECT(\"Calendar!E\"&MATCH($A25,Calendar!A:A,0)-1),0,IF(INDIRECT(\"Calendar!E\"&MATCH($A25,Calendar!A:A,0)-2),1,2))","v":0}]
["2022-03-03",651970,432616,651970,432616,850236.93488372094,535345.08796060295,215,573360.07937042648,1939621.0856875312,2783016,{"$f":"IF($A27=\"\",\"\",IF($H$3=\"YES\",VLOOKUP(OFFSET(A27,N26,0),Calendar!$A$2:$C$10000,3,FALSE),1))","v":1},{"$f":"IF(A27=\"\",\"\",IF(VLOOKUP(A26,Calendar!A:E,5,FALSE)=0,\"\",CEILING(L26*CEILING(MAX(OFFSET(K26,N26,0),OFFSET(J26,N26,0)),roundto),roundto)+add_margin))","v":2840000},{"$f":"IF(INDIRECT(\"Calendar!E\"&MATCH($A26,Calendar!A:A,0)-1),0,IF(INDIRECT(\"Calendar!E\"&MATCH($A26,Calendar!A:A,0)-2),1,2))","v":0}]
["2022-03-02",862497,588877,862497,588877,845683.01860465121,537015.61022572138,215,575149.22584820061,1938466.5477162325,2783016,{"$f":"IF($A28=\"\",\"\",IF($H$3=\"YES\",VLOOKUP(OFFSET(A28,N27,0),Calendar!$A$2:$C$10000,3,FALSE),1))","v":1},{"$f":"IF(A28=\"\",\"\",IF(VLOOKUP(A27,Calendar!A:E,5,FALSE)=0,\"\",CEILING(L27*CEILING(MAX(OFFSET(K27,N27,0),OFFSET(J27,N27,0)),roundto),roundto)+add_margin))","v":2840000},{"$f":"IF(INDIRECT(\"Calendar!E\"&MATCH($A27,Calendar!A:A,0)-1),0,IF(INDIRECT(\"Calendar!E\"&MATCH($A27,Calendar!A:A,0)-2),1,2))","v":0}]
["2022-03-01",1253310,741357,1253310,741357,843432.72558139532,540121.50798905781,215,578475.67420488014,1942536.5065706675,2783016,{"$f":"IF($A29=\"\",\"\",IF($H$3=\"YES\",VLOOKUP(OFFSET(A29,N28,0),Calendar!$A$2:$C$10000,3,FALSE),1))","v":1},{"$f":"IF(A29=\"\",\"\",IF(VLOOKUP(A28,Calendar!A:E,5,FALSE)=0,\"\",CEILING(L28*CEILING(MAX(OFFSET(K28,N28,0),OFFSET(J28,N28,0)),roundto),roundto)+add_margin))","v":2840000},{"$f":"IF(INDIRECT(\"Calendar!E\"&MATCH($A28,Calendar!A:A,0)-1),0,IF(INDIRECT(\"Calendar!E\"&MATCH($A28,Calendar!A:A,0)-2),1,2))","v":0}]
["2022-02-28",1123881,533563,1123881,533563,845044.54883720935,542871.49112467642,215,581420.93434523593,1949744.3240931577,2783016,{"$f":"IF($A30=\"\",\"\",IF($H$3=\"YES\",VLOOKUP(OFFSET(A30,N29,0),Calendar!$A$2:$C$10000,3,FALSE),1))","v":1},{"$f":"IF(A30=\"\",\"\",IF(VLOOKUP(A29,Calendar!A:E,5,FALSE)=0,\"\",CEILING(L29*CEILING(MAX(OFFSET(K29,N29,0),OFFSET(J29,N29,0)),roundto),roundto)+add_margin))","v":2840000},{"$f":"IF(INDIRECT(\"Calendar!E\"&MATCH($A29,Calendar!A:A,0)-1),0,IF(INDIRECT(\"Calendar!E\"&MATCH($A29,Calendar!A:A,0)-2),1,2))","v":0}]
["2022-02-25",695014,474965,695014,474965,843933.88837209297,545118.2309128975,215,583827.21569957968,1953205.5982012944,2783016,{"$f":"IF($A31=\"\",\"\",IF($H$3=\"YES\",VLOOKUP(OFFSET(A31,N30,0),Calendar!$A$2:$C$10000,3,FALSE),1))","v":1},{"$f":"IF(A31=\"\",\"\",IF(VLOOKUP(A30,Calendar!A:E,5,FALSE)=0,\"\",CEILING(L30*CEILING(MAX(OFFSET(K30,N30,0),OFFSET(J30,N30,0)),roundto),roundto)+add_margin))","v":2840000},{"$f":"IF(INDIRECT(\"Calendar!E\"&MATCH($A30,Calendar!A:A,0)-1),0,IF(INDIRECT(\"Calendar!E\"&MATCH($A30,Calendar!A:A,0)-2),1,2))","v":0}]
["2022-02-24",884049,587569,884049,587569,843160.63255813951,546527.61727552593,215,585336.68294774042,1955300.3301588462,2783016,{"$f":"IF($A32=\"\",\"\",IF($H$3=\"YES\",VLOOKUP(OFFSET(A32,N31,0),Calendar!$A$2:$C$10000,3,FALSE),1))","v":1},{"$f":"IF(A32=\"\",\"\",IF(VLOOKUP(A31,Calendar!A:E,5,FALSE)=0,\"\",CEILING(L31*CEILING(MAX(OFFSET(K31,N31,0),OFFSET(J31,N31,0)),roundto),roundto)+add_margin))","v":2840000},{"$f":"IF(INDIRECT(\"Calendar!E\"&MATCH($A31,Calendar!A:A,0)-1),0,IF(INDIRECT(\"Calendar!E\"&MATCH($A31,Calendar!A:A,0)-2),1,2))","v":0}]
["2022-02-23",1144105,715273,1144105,715273,840939.96744186047,544389.04538012017,215,583046.25051590416,1948727.8434220785,2783016,{"$f":"IF($A33=\"\",\"\",IF($H$3=\"YES\",VLOOKUP(OFFSET(A33,N32,0),Calendar!$A$2:$C$10000,3,FALSE),1))","v":1},{"$f":"IF(A33=\"\",\"\",IF(VLOOKUP(A32,Calendar!A:E,5,FALSE)=0,\"\",CEILING(L32*CEILING(MAX(OFFSET(K32,N32,0),OFFSET(J32,N32,0)),roundto),roundto)+add_margin))","v":2840000},{"$f":"IF(INDIRECT(\"Calendar!E\"&MATCH($A32,Calendar!A:A,0)-1),0,IF(INDIRECT(\"Calendar!E\"&MATCH($A32,Calendar!A:A,0)-2),1,2))","v":0}]
["2022-02-22",1575066,1063504,1575066,1063504,837869.6744186047,548696.37929159775,215,587659.449308421,1954422.6281046045,3581795.2,{"$f":"IF($A34=\"\",\"\",IF($H$3=\"YES\",VLOOKUP(OFFSET(A34,N33,0),Calendar!$A$2:$C$10000,3,FALSE),1))","v":1},{"$f":"IF(A34=\"\",\"\",IF(VLOOKUP(A33,Calendar!A:E,5,FALSE)=0,\"\",CEILING(L33*CEILING(MAX(OFFSET(K33,N33,0),OFFSET(J33,N33,0)),roundto),roundto)+add_margin))","v":3640000},{"$f":"IF(INDIRECT(\"Calendar!E\"&MATCH($A33,Calendar!A:A,0)-1),0,IF(INDIRECT(\"Calendar!E\"&MATCH($A33,Calendar!A:A,0)-2),1,2))","v":0}]
["2022-02-21",1217077,310029,1217077,310029,840061.5953488372,549364.10450215847,215,588374.589856704,1957973.3160765748,3581795.2,{"$f":"IF($A35=\"\",\"\",IF($H$3=\"YES\",VLOOKUP(OFFSET(A35,N34,0),Calendar!$A$2:$C$10000,3,FALSE),1))","v":1},{"$f":"IF(A35=\"\",\"\",IF(VLOOKUP(A34,Calendar!A:E,5,FALSE)=0,\"\",CEILING(L34*CEILING(MAX(OFFSET(K34,N34,0),OFFSET(J34,N34,0)),roundto),roundto)+add_margin))","v":3640000},{"$f":"IF(INDIRECT(\"Calendar!E\"&MATCH($A34,Calendar!A:A,0)-1),0,IF(INDIRECT(\"Calendar!E\"&MATCH($A34,Calendar!A:A,0)-2),1,2))","v":0}]
["2022-02-18",410225,301574,410225,301574,839145.61860465119,550507.1870122212,215,589598.8429477209,1959383.4202053209,3581795.2,{"$f":"IF($A36=\"\",\"\",IF($H$3=\"YES\",VLOOKUP(OFFSET(A36,N35,0),Calendar!$A$2:$C$10000,3,FALSE),1))","v":1},{"$f":"IF(A36=\"\",\"\",IF(VLOOKUP(A35,Calendar!A:E,5,FALSE)=0,\"\",CEILING(L35*CEILING(MAX(OFFSET(K35,N35,0),OFFSET(J35,N35,0)),roundto),roundto)+add_margin))","v":3640000},{"$f":"IF(INDIRECT(\"Calendar!E\"&MATCH($A35,Calendar!A:A,0)-1),0,IF(INDIRECT(\"Calendar!E\"&MATCH($A35,Calendar!A:A,0)-2),1,2))","v":0}]
["2022-02-17",626020,483621,626020,483621,836444.35348837206,554846.79771223827,215,594246.6105117742,1965512.9134607431,3581795.2,{"$f":"IF($A37=\"\",\"\",IF($H$3=\"YES\",VLOOKUP(OFFSET(A37,N36,0),Calendar!$A$2:$C$10000,3,FALSE),1))","v":1},{"$f":"IF(A37=\"\",\"\",IF(VLOOKUP(A36,Calendar!A:E,5,FALSE)=0,\"\",CEILING(L36*CEILING(MAX(OFFSET(K36,N36,0),OFFSET(J36,N36,0)),roundto),roundto)+add_margin))","v":3640000},{"$f":"IF(INDIRECT(\"Calendar!E\"&MATCH($A36,Calendar!A:A,0)-1),0,IF(INDIRECT(\"Calendar!E\"&MATCH($A36,Calendar!A:A,0)-2),1,2))","v":0}]
["2022-02-16",580668,333994,580668,333994,835488.02790697676,555965.04421545996,215,595444.2639847619,1966832.1294780243,3581795.2,{"$f":"IF($A38=\"\",\"\",IF($H$3=\"YES\",VLOOKUP(OFFSET(A38,N37,0),Calendar!$A$2:$C$10000,3,FALSE),1))","v":1},{"$f":"IF(A38=\"\",\"\",IF(VLOOKUP(A37,Calendar!A:E,5,FALSE)=0,\"\",CEILING(L37*CEILING(MAX(OFFSET(K37,N37,0),OFFSET(J37,N37,0)),roundto),roundto)+add_margin))","v":3640000},{"$f":"IF(INDIRECT(\"Calendar!E\"&MATCH($A37,Calendar!A:A,0)-1),0,IF(INDIRECT(\"Calendar!E\"&MATCH($A37,Calendar!A:A,0)-2),1,2))","v":0}]
["2022-02-15",743322,628866,743322,628866,832089.69767441857,562266.93738186522,215,602193.65619425941,1976257.6444435115,3581795.2,{"$f":"IF($A39=\"\",\"\",IF($H$3=\"YES\",VLOOKUP(OFFSET(A39,N38,0),Calendar!$A$2:$C$10000,3,FALSE),1))","v":1},{"$f":"IF(A39=\"\",\"\",IF(VLOOKUP(A38,Calendar!A:E,5,FALSE)=0,\"\",CEILING(L38*CEILING(MAX(OFFSET(K38,N38,0),OFFSET(J38,N38,0)),roundto),roundto)+add_margin))","v":3640000},{"$f":"IF(INDIRECT(\"Calendar!E\"&MATCH($A38,Calendar!A:A,0)-1),0,IF(INDIRECT(\"Calendar!E\"&MATCH($A38,Calendar!A:A,0)-2),1,2))","v":0}]
["2022-02-14",656513,254069,656513,254069,831369.4790697674,563624.58238725213,215,603647.70791818737,1978300.1241143234,3581795.2,{"$f":"IF($A40=\"\",\"\",IF($H$3=\"YES\",VLOOKUP(OFFSET(A40,N39,0),Calendar!$A$2:$C$10000,3,FALSE),1))","v":1},{"$f":"IF(A40=\"\",\"\",IF(VLOOKUP(A39,Calendar!A:E,5,FALSE)=0,\"\",CEILING(L39*CEILING(MAX(OFFSET(K39,N39,0),OFFSET(J39,N39,0)),roundto),roundto)+add_margin))","v":3640000},{"$f":"IF(INDIRECT(\"Calendar!E\"&MATCH($A39,Calendar!A:A,0)-1),0,IF(INDIRECT(\"Calendar!E\"&MATCH($A39,Calendar!A:A,0)-2),1,2))","v":0}]
["2022-02-11",248557,144410,248557,144410,831170.25581395347,563926.23370681005,215,603970.77957498131,1978714.7370064179,3581795.2,{"$f":"IF($A41=\"\",\"\",IF($H$3=\"YES\",VLOOKUP(OFFSET(A41,N40,0),Calendar!$A$2:$C$10000,3,FALSE),1))","v":1},{"$f":"IF(A41=\"\",\"\",IF(VLOOKUP(A40,Calendar!A:E,5,FALSE)=0,\"\",CEILING(L40*CEILING(MAX(OFFSET(K40,N40,0),OFFSET(J40,N40,0)),roundto),roundto)+add_margin))","v":3640000},{"$f":"IF(INDIRECT(\"Calendar!E\"&MATCH($A40,Calendar!A:A,0)-1),0,IF(INDIRECT(\"Calendar!E\"&MATCH($A40,Calendar!A:A,0)-2),1,2))","v":0}]
{"$rows_left_out":471}
{"sheet":"Parameter","index":1,"n_rows":252,"n_cols":5,"rows_kept":252,"cut":false,"hidden":false,"merged":[]}
["Number of Datapoints","Security Addon"]
[0,0,null,"Window Size Statistic",250]
[1,0,null,"Window Size Maximum",30]
[2,1.6464531921788299,null,"EWMA Factor",0.99]
[3,1.51596429420337,null,"alpha",1.9]
[4,1.4431673736408299,null,"beta",1.6]
[5,1.3942467739120901,null,"minIMSM in EUR",0]
[6,1.3591928918664999,null,"roundto",10000]
[7,1.3329649321228201,null,"Additional Margin in EUR",50000]
[8,1.3105975438573201]
[9,1.29242608407995]
[10,1.2770521503339001]
[11,1.2644194572563601]
[12,1.2534592542173699]
[13,1.24335810936183]
[14,1.2349478625339001]
[15,1.2261575429460001]
[16,1.21965922108263]
[17,1.21308045729499]
[18,1.2074966101194]
[19,1.2020124854293299]
[20,1.1970298038029601]
[21,1.1921734055497]
[22,1.18814000790574]
[23,1.1840717097945099]
[24,1.1800213998078699]
[25,1.17652192038657]
[26,1.17311998226031]
[27,1.16953597813231]
[28,1.16730325039722]
[29,1.1641647697281901]
[30,1.16142207580107]
[31,1.1591515407676101]
[32,1.1561645523792801]
[33,1.15390926903878]
[34,1.1520815055611699]
[35,1.1499360783883701]
[36,1.1481784728431901]
[37,1.1459844805091499]
[38,1.1442326341837501]
{"$rows_left_out":213}
{"sheet":"Calendar","index":2,"n_rows":1306,"n_cols":7,"rows_kept":1306,"cut":false,"hidden":false,"merged":[]}
["ECC Calendar ","index","Holiday Adjustment Scaling Factor","Flag Weekday","ECC Business Day","Rows Until Next Business Day","Days Until Business Day After Next BD"]
["2020-01-01",{"$f":"ROW(A2)-1","v":1},{"$f":"1+0.3*MAX(G2-4,0)","v":1},null,0,{"$f":"IF($E2=1,MATCH(1,INDIRECT(\"$E$\"&ROW($A2)+1&\":$E$2598\"),0),0)","v":0},{"$f":"IF($E2=1,INDIRECT(\"$A$\"&ROW($A2)+MATCH(1,INDIRECT(\"$E$\"&ROW($A2)+1+$F2&\":$E$2598\"),0)+$F2)-$A2,0)","v":0}]
["2020-01-02",{"$f":"ROW(A3)-1","v":2},{"$f":"1+0.3*MAX(G3-4,0)","v":1},{"$f":"IF(ABS(WEEKDAY($A3)-4)<=1,1,0)","v":1},1,{"$f":"IF($E3=1,MATCH(1,INDIRECT(\"$E$\"&ROW($A3)+1&\":$E$2598\"),0),0)","v":1},4]
["2020-01-03",3,1,0,1,1,4]
["2020-01-06",4,1,0,1,1,2]
["2020-01-07",5,1,1,1,1,2]
["2020-01-08",6,1,1,1,1,2]
["2020-01-09",7,1,1,1,1,4]
["2020-01-10",8,1,0,1,1,4]
["2020-01-13",9,1,0,1,1,2]
["2020-01-14",10,1,1,1,1,2]
["2020-01-15",11,1,1,1,1,2]
["2020-01-16",12,1,1,1,1,4]
["2020-01-17",13,1,0,1,1,4]
["2020-01-20",14,1,0,1,1,2]
["2020-01-21",15,1,1,1,1,2]
["2020-01-22",16,1,1,1,1,2]
["2020-01-23",17,1,1,1,1,4]
["2020-01-24",18,1,0,1,1,4]
["2020-01-27",19,1,0,1,1,2]
["2020-01-28",20,1,1,1,1,2]
["2020-01-29",21,1,1,1,1,2]
["2020-01-30",22,1,1,1,1,4]
["2020-01-31",23,1,0,1,1,4]
["2020-02-03",24,1,0,1,1,2]
["2020-02-04",25,1,1,1,1,2]
["2020-02-05",26,1,1,1,1,2]
["2020-02-06",27,1,1,1,1,4]
["2020-02-07",28,1,0,1,1,4]
["2020-02-10",29,1,0,1,1,2]
["2020-02-11",30,1,1,1,1,2]
["2020-02-12",31,1,1,1,1,2]
["2020-02-13",32,1,1,1,1,4]
["2020-02-14",33,1,0,1,1,4]
["2020-02-17",34,1,0,1,1,2]
["2020-02-18",35,1,1,1,1,2]
["2020-02-19",36,1,1,1,1,2]
["2020-02-20",37,1,1,1,1,4]
["2020-02-21",38,1,0,1,1,4]
["2020-02-24",39,1,0,1,1,2]
{"$rows_left_out":1267}
{"sheet":"Disclaimer","index":3,"n_rows":8,"n_cols":4,"rows_kept":8,"cut":false,"hidden":false,"merged":[[4,3,4,6],[5,3,5,4],[7,3,9,21]]}
[]
[]
[]
[]
[null,null,null,"Disclaimer"]
[null,null,null,"last update: 2023-08-16"]
[]
[null,null,null,"This tool is only a service for recalculating the Initial Margin Spot Market.\n Although the tool was constructed with greatest diligence, errors, rounding errors and therefore deviations from the productive process cannot be excluded. In cases of doubt, the calculated value of the IMSM programm shall prevail. The disclaimer at\nhttp://www.ecc.de/ecc-en/extras/disclaimer shall apply to the use of this tool as well.\n"]