{"text_format":"1","workbook":"xlsx","n_sheets":9,"sheets":["Sample Portfolio and Netting","Tiers","Intra Charge","Sample Portfolio and Netting_tm","Risk Arrays and Scan Risk","Risk Arrays and Scan Risk_tmp","Risk Arrays Options","Spreads","Intracommodity Credits"],"not_rendered":{"charts":0,"images":0,"macros":1,"external_links":0,"defined_names":10,"comments":0,"pivot_tables":0},"unopened":[],"bounds":{"document_bytes":16777216,"sheet_cells":100000,"rows_first":2000,"rows_last":500,"rows_between":2000,"halvings":0,"cell_chars":16384,"cell_head_chars":4096},"cells_cut":0,"cells_raw":0,"read":"whole","date_system":"1900"}

{"sheet":"Sample Portfolio and Netting","index":0,"n_rows":5,"n_cols":15,"rows_kept":5,"cut":false,"hidden":false,"merged":[]}
[]
[null,"Product","Combined Commodity","Period Code","Tier","Call/Put","Strike Price","Contract Volume","Net Position","Scanning Range","Single Margin Parameter (SMP) Tier","Composite Delta","Original Delta","Original Delta (Gross) Scaled","Original Delta (Net) Scaled"]
[null,"P5TC","P5TC",202305,"Tier 2",null,null,1,-50,{"$f":"Tiers!G6","v":4220.5941585656583},{"$f":"+J3/H3","v":4220.5941585656583},1,{"$f":"H3*ABS(I3)*L3","v":50},{"$f":"(H3*ABS(I3)*L3)/100","v":0.5},{"$f":"(H3*I3*L3)/100","v":-0.5}]
[null,"P5TC","P5TC",202307,"Tier 3",null,null,1,100,{"$f":"+Tiers!G8","v":1527.9534659249662},{"$f":"J4/H4","v":1527.9534659249662},1,{"$f":"H4*ABS(I4)*L4","v":100},{"$f":"(H4*ABS(I4)*L4)/100","v":1},{"$f":"(H4*I4*L4)/100","v":1}]
[null,"P5TC","P5TC",202310,"Tier 3",null,null,1,-75,{"$f":"+Tiers!G11","v":1527.9534659249662},{"$f":"J5/H5","v":1527.9534659249662},1,{"$f":"H5*ABS(I5)*L5","v":75},{"$f":"(H5*ABS(I5)*L5)/100","v":0.75},{"$f":"(H5*I5*L5)/100","v":-0.75}]

{"sheet":"Tiers","index":1,"n_rows":25,"n_cols":8,"rows_kept":25,"cut":false,"hidden":false,"merged":[[4,7,6,7],[7,7,24,7],[1,1,1,3],[4,1,6,1],[4,2,6,2],[4,3,6,3],[7,1,24,1],[7,2,24,2],[7,3,24,3]]}
[]
[null,"Combined Commodity P5TC"]
[null,"Tier","Start Period","End Period","Period Code","SMP","SMP [TIER]","IntraCharge"]
[null,1,202303,202303,202303,5071.41,5071.41,0]
[null,2,202304,202306,202304,5071.4122424097268,{"$f":"+SUM($F$5:$F$7)/3","v":4220.5941585656583},{"$f":"+SUMIF('Intra Charge'!D:D,IFERROR(VLOOKUP(E5,'Intra Charge'!B:D,3,FALSE),VLOOKUP(E5,'Intra Charge'!C:D,2,FALSE)),'Intra Charge'!N:N)","v":3368.4436950234608}]
[null,null,null,null,202305,4075.2005747814633,{"$f":"+SUM($F$5:$F$7)/3","v":4220.5941585656583}]
[null,null,null,null,202306,3515.1696585057862,4220.5941585656583]
[null,3,202307,202412,202307,2827.9356854377802,{"$f":"+SUM($F$8:$F$25)/18","v":1527.9534659249662},{"$f":"+SUMIF('Intra Charge'!D:D,IFERROR(VLOOKUP(E8,'Intra Charge'!B:D,3,FALSE),VLOOKUP(E8,'Intra Charge'!C:D,2,FALSE)),'Intra Charge'!N:N)","v":1263.2403712460732}]
[null,null,null,null,202308,2407.3872481248841,{"$f":"+SUM($F$8:$F$25)/18","v":1527.9534659249662}]
[null,null,null,null,202309,2556.3296720044414,1527.9534659249662]
[null,null,null,null,202310,2191.13660857165,1527.9534659249662]
[null,null,null,null,202311,1975.811280086217,1527.9534659249662]
[null,null,null,null,202312,1827.6199910734695,1527.9534659249662]
[null,null,null,null,202401,1424.4238577851318,1527.9534659249662]
[null,null,null,null,202402,1290.7545095307039,1527.9534659249662]
[null,null,null,null,202403,1203.6010929556614,1527.9534659249662]
[null,null,null,null,202404,1255.6797770544626,1527.9534659249662]
[null,null,null,null,202405,1180.8275546749981,1527.9534659249662]
[null,null,null,null,202406,1097.6475326852526,1527.9534659249662]
[null,null,null,null,202407,982.59326591262879,1527.9534659249662]
{"$rows_left_out":6}
{"sheet":"Intra Charge","index":2,"n_rows":157,"n_cols":14,"rows_kept":157,"cut":false,"hidden":false,"merged":[]}
["Product","PeriodA","PeriodB","TierA","TierB","SMPB","SMPA","Credit","SMP_Tier","NumberTier","Gross Margin","Net Margin","NM/GM","IntraCharge"]
["P5TC",202304,202305,2,2,4075.2005747814633,5071.4122424097268,0.6,{"$f":"+VLOOKUP(B2,Tiers!E:G,3,FALSE)","v":4220.5941585656583},{"$f":"+COUNTIF(D:D,D2)","v":3},{"$f":"+G2+F2","v":9146.6128171911896},{"$f":"+K2-2*H2*MIN(F2,G2)","v":4256.3721274534337},{"$f":"+L2/K2","v":0.46534954660522215},{"$f":"2*I2*M2/J2","v":1309.3677187287856}]
["P5TC",202304,202306,2,2,3515.1696585057862,5071.4122424097268,0.61,{"$f":"+VLOOKUP(B3,Tiers!E:G,3,FALSE)","v":4220.5941585656583},3,8586.581900915513,4298.0749175384535,{"$f":"+L3/K3","v":0.50055714452338562},{"$f":"2*I3*M3/J3","v":1408.4323734691382}]
["P5TC",202305,202306,2,2,3515.1696585057862,4075.2005747814633,0.83,{"$f":"+VLOOKUP(B4,Tiers!E:G,3,FALSE)","v":4220.5941585656583},3,7590.370233287249,1755.1886001676439,0.23123886532837862,650.64360282553719]
["P5TC",202307,202308,3,3,2407.3872481248841,2827.9356854377806,0.77,{"$f":"+VLOOKUP(B5,Tiers!E:G,3,FALSE)","v":1527.9534659249662},153,5235.3229335626647,1527.9465714503431,0.29185335667738216,5.8292594493730912]
["P5TC",202307,202309,3,3,2556.3296720044414,2827.9356854377806,0.75,{"$f":"+VLOOKUP(B6,Tiers!E:G,3,FALSE)","v":1527.9534659249662},153,5384.265357442222,1549.7708494355602,0.28783329694058279,5.7489657995944237]
["P5TC",202307,202310,3,3,2191.1366085716463,2827.9356854377806,0.75,{"$f":"+VLOOKUP(B7,Tiers!E:G,3,FALSE)","v":1527.9534659249662},153,5019.0722940094274,1732.3673811519579,0.34515688949522511,6.8939041253870554]
["P5TC",202307,202311,3,3,1975.811280086217,2827.9356854377806,0.77,{"$f":"+VLOOKUP(B8,Tiers!E:G,3,FALSE)","v":1527.9534659249662},153,4803.7469655239975,1760.997594191223,0.36658833340509467,7.3219596678950509]
["P5TC",202307,202312,3,3,1827.6199910734695,2827.9356854377806,0.78,{"$f":"+VLOOKUP(B9,Tiers!E:G,3,FALSE)","v":1527.9534659249662},153,4655.5556765112506,1804.4684904366381,0.38759465374686675,7.7415241119805511]
["P5TC",202307,202401,3,3,1424.4238577851318,2827.9356854377806,0.76,{"$f":"+VLOOKUP(B10,Tiers!E:G,3,FALSE)","v":1527.9534659249662},153,4252.3595432229122,2087.235279389512,0.49084167464531292,9.8037024574473257]
["P5TC",202307,202402,3,3,1290.7545095307039,2827.9356854377806,0.75,{"$f":"+VLOOKUP(B11,Tiers!E:G,3,FALSE)","v":1527.9534659249662},153,4118.6901949684843,2182.5584306724286,0.52991565943432883,10.584136842883618]
["P5TC",202307,202403,3,3,1203.6010929556614,2827.9356854377806,0.73,{"$f":"+VLOOKUP(B12,Tiers!E:G,3,FALSE)","v":1527.9534659249662},153,4031.5367783934421,2274.2791826781768,0.56412214688624807,11.267351497253276]
["P5TC",202307,202404,3,3,1255.6797770544626,2827.9356854377806,0.73,{"$f":"+VLOOKUP(B13,Tiers!E:G,3,FALSE)","v":1527.9534659249662},153,4083.6154624922433,2250.3229879927276,0.55106143285571463,11.006486617901533]
["P5TC",202307,202405,3,3,1180.8275546749981,2827.9356854377806,0.71,{"$f":"+VLOOKUP(B14,Tiers!E:G,3,FALSE)","v":1527.9534659249662},153,4008.7632401127785,2331.9881124742815,0.5817225844469367,11.618889400163736]
["P5TC",202307,202406,3,3,1097.6475326852526,2827.9356854377806,0.71,{"$f":"+VLOOKUP(B15,Tiers!E:G,3,FALSE)","v":1527.9534659249662},153,3925.5832181230335,2366.9237217099749,0.60294829842931941,12.042835847825351]
["P5TC",202307,202407,3,3,982.59326591262879,2827.9356854377806,0.71,{"$f":"+VLOOKUP(B16,Tiers!E:G,3,FALSE)","v":1527.9534659249662},153,3810.5289513504094,2415.2465137544768,0.63383497267447353,12.65974304996625]
["P5TC",202307,202408,3,3,968.25638736787107,2827.9356854377806,0.69,{"$f":"+VLOOKUP(B17,Tiers!E:G,3,FALSE)","v":1527.9534659249662},153,3796.1920728056516,2459.9982582379898,0.64801733185746813,12.943010826027026]
["P5TC",202307,202409,3,3,930.52546782638979,2827.9356854377806,0.66,{"$f":"+VLOOKUP(B18,Tiers!E:G,3,FALSE)","v":1527.9534659249662},153,3758.4611532641702,2530.1675357333356,0.67319241374516292,13.445838977991054]
["P5TC",202307,202410,3,3,891.32493658897681,2827.9356854377806,0.57999999999999996,{"$f":"+VLOOKUP(B19,Tiers!E:G,3,FALSE)","v":1527.9534659249662},153,3719.2606220267576,2685.3236955835446,0.7220047123560317,14.420779119719697]
["P5TC",202307,202411,3,3,1153.0899946658537,2827.9356854377806,0.57999999999999996,{"$f":"+VLOOKUP(B20,Tiers!E:G,3,FALSE)","v":1527.9534659249662},153,3981.0256801036344,2643.4412862912441,0.66401010661715443,13.262438481240357]
{"$rows_left_out":138}
{"sheet":"Sample Portfolio and Netting_tm","index":3,"n_rows":17,"n_cols":16,"rows_kept":17,"cut":false,"hidden":true,"merged":[[2,14,5,14],[2,15,5,15]]}
[]
[null,"Product","Combined Commodity","Period Code","Call/Put","Strike Price","Contract Volume","Net Position","Tier","Single Margin Parameter (SMP)","Scanning Range","Scanning Range Tier","Composite Delta","Original Delta","Original Delta (Gross) Scaled","Original Delta (Net) Scaled"]
[null,"OP5M","P5TC",202304,"P",10000,1,1,2,5071.4122424097268,{"$f":"+J3*G3","v":5071.4122424097268},4220.59,-1.771E-3,{"$f":"G3*ABS(H3)*M3","v":-1.771E-3},{"$f":"((G3*(H3)*M3)+(G4*(H4)*M4)+(G5*ABS(H5)*M5)+(G6*ABS(H6)*M6))/100","v":9.7673799999999991E-3},{"$f":"((G3*H3*M3)+(G4*H4*M4)+(G5*H5*M5)+(G6*(H6)*M6))/100","v":-1.023262E-2}]
[null,"OP5M","P5TC",202305,"P",10000,1,1,2,4075.2005747814633,{"$f":"+J4*G4","v":4075.2005747814633},4220.59,-7.3889999999999997E-3,{"$f":"G4*ABS(H4)*M4","v":-7.3889999999999997E-3}]
[null,"OP5M","P5TC",202306,"P",10000,1,1,2,3515.1696585057862,3515.1696585057862,4220.59,-1.4102E-2,-1.4102E-2,null,{"$f":"(G5*H5*M5)/100","v":-1.4102E-4}]
[null,"P5TC","P5TC",202305,null,null,1,-1,2,4075.2005747814633,4075.2005747814633,4220.59,1,1,null,{"$f":"(G6*H6*M6)/100","v":-0.01}]
[null,"OP5M","P5TC",202307,"P",10000,1,1,3,2827.9356854377806,2827.9356854377806,1527.95,-1.3018999999999999E-2,-1.3018999999999999E-2,{"$f":"(G7*ABS(H7)*M7)/100","v":-1.3019E-4},-1.3019E-4]
[]
[]
[]
[]
[]
[]
[]
[]
[]
[null,null,null,null,null,null," "]

{"sheet":"Risk Arrays and Scan Risk","index":4,"n_rows":9,"n_cols":30,"rows_kept":9,"cut":false,"hidden":false,"merged":[[7,28,8,28],[7,29,8,29],[1,12,1,27],[2,10,2,11],[3,10,3,11],[4,10,4,11]]}
[]
[null,null,null,null,null,null,null,null,null,null,null,null,"Risk Arrays"]
[null,null,null,null,null,null,null,null,null,null,"Price Scan Change",null,0,0,0.33333333333333331,0.33333333333333331,-0.33333333333333331,-0.33333333333333331,0.66666666666666663,0.66666666666666663,-0.66666666666666663,-0.66666666666666663,1,1,-1,-1,3,-3]
[null,null,null,null,null,null,null,null,null,null,"Vola Scan Change",null,1,-1,1,-1,1,-1,1,-1,1,-1,1,-1,1,-1,1,-1]
[null,null,null,null,null,null,null,null,null,null,"Weight",null,1,1,1,1,1,1,1,1,1,1,1,1,1,1,0.33,0.33]
[null,"Product","Combined Commodity","Period Code","Call/Put","Strike Price","Contract Volume","Net Position","Tier","Scanning Range","SMP","Composite Delta","Scenario 1","Scenario 2","Scenario3","Scenario 4","Scenario 5","Scenario 6","Scenario 7","Scenario 8","Scenario 9","Scenario 10","Scenario 11","Scenario 12","Scenario 13","Scenario 14","Scenario 15","Scenario 16","Active Scenario","Scan Risk"]
[null,"P5TC","P5TC",202305,null,null,1,{"$f":"+'Sample Portfolio and Netting'!I3","v":-50},2,{"$f":"+Tiers!G6","v":4220.5941585656583},{"$f":"+J7/G7","v":4220.5941585656583},1,{"$f":"-1*$H7*$J7*M$3*M$5","v":0},0,70343.235976094293,70343.235976094293,-70343.235976094293,-70343.235976094293,140686.47195218859,140686.47195218859,-140686.47195218859,-140686.47195218859,211029.70792828291,211029.70792828291,-211029.70792828291,-211029.70792828291,208919.41084900009,-208919.41084900009,{"$f":"MATCH(MAX(M7:AB7),M7:AB7,0)","v":11},{"$f":"MAX(M7:AB7)","v":211029.70792828291}]
[null,{"$f":"+'Sample Portfolio and Netting'!B4","v":"P5TC"},{"$f":"+'Sample Portfolio and Netting'!C4","v":"P5TC"},{"$f":"+'Sample Portfolio and Netting'!D4","v":202307},null,null,{"$f":"+'Sample Portfolio and Netting'!H4","v":1},{"$f":"+'Sample Portfolio and Netting'!I4","v":100},3,{"$f":"Tiers!G8","v":1527.9534659249662},{"$f":"J8/G8","v":1527.9534659249662},1,0,0,-50931.782197498869,-50931.782197498869,50931.782197498869,50931.782197498869,-101863.56439499774,-101863.56439499774,101863.56439499774,101863.56439499774,-152795.34659249661,-152795.34659249661,152795.34659249661,152795.34659249661,-151267.39312657167,151267.39312657167,{"$f":"MATCH(MAX((M8:AB8)+(M9:AB9)),(M8:AB8)+(M9:AB9),0)","v":13},{"$f":"MAX((M8:AB8)+(M9:AB9))","v":38198.836648124154}]
[null,{"$f":"+'Sample Portfolio and Netting'!B5","v":"P5TC"},{"$f":"+'Sample Portfolio and Netting'!C5","v":"P5TC"},{"$f":"+'Sample Portfolio and Netting'!D5","v":202310},null,null,{"$f":"+'Sample Portfolio and Netting'!H5","v":1},{"$f":"+'Sample Portfolio and Netting'!I5","v":-75},3,{"$f":"+Tiers!G11","v":1527.9534659249662},{"$f":"J9/G9","v":1527.9534659249662},1,0,0,38198.836648124154,38198.836648124154,-38198.836648124154,-38198.836648124154,76397.673296248307,76397.673296248307,-76397.673296248307,-76397.673296248307,114596.50994437246,114596.50994437246,-114596.50994437246,-114596.50994437246,113450.54484492874,-113450.54484492874]

{"sheet":"Risk Arrays and Scan Risk_tmp","index":5,"n_rows":18,"n_cols":30,"rows_kept":18,"cut":false,"hidden":true,"merged":[[17,11,17,12],[6,28,9,28],[6,29,9,29],[1,12,1,27],[2,10,2,11],[3,10,3,11],[4,10,4,11]]}
[]
[null,null,null,null,null,null,null,null,null,null,null,null,"Risk Arrays (By default for 1 Long Position)"]
[null,null,null,null,null,null,null,null,null,null,"Price Scan Change",null,0,0,0.33333333333333331,0.33333333333333331,-0.33333333333333331,-0.33333333333333331,0.66666666666666663,0.66666666666666663,-0.66666666666666663,-0.66666666666666663,1,1,-1,-1,3,-3]
[null,null,null,null,null,null,null,null,null,null,"Vola Scan Change",null,1,-1,1,-1,1,-1,1,-1,1,-1,1,-1,1,-1,1,-1]
[null,null,null,null,null,null,null,null,null,null,"Weight",null,1,1,1,1,1,1,1,1,1,1,1,1,1,1,0.33,0.33]
[null,"Product","Combined Commodity","Period Code","Call/Put","Strike Price","Contract Value Factor","Net Position","Scanning Range [Tier]","Tier","SMP","Composite Delta","Scenario 1","Scenario 2","Scenario3","Scenario 4","Scenario 5","Scenario 6","Scenario 7","Scenario 8","Scenario 9","Scenario 10","Scenario 11","Scenario 12","Scenario 13","Scenario 14","Scenario 15","Scenario 16","Active Scenario","Scan Risk"]
[null,"P5TC","P5TC",202305,null,null,1,-1,4220.59,2,{"$f":"I7/G7","v":4220.59},1,{"$f":"$K7*$G7*M$3*M$5","v":0},0,1406.8633333333332,1406.8633333333332,-1406.8633333333332,-1406.8633333333332,2813.7266666666665,2813.7266666666665,-2813.7266666666665,-2813.7266666666665,4220.59,4220.59,-4220.59,-4220.59,4178.3841000000002,-4178.3841000000002,{"$f":"-1*MIN((SIGN($H$7)*M7:AB7)+(SIGN($H$9)*M9:AB9)+(SIGN($H$8)*M8:AB8) +(SIGN($H$10)*M10:AB10))","v":4242.09},{"$f":"-1*(H7*AC7)+(H8*AC8)+(H9*AC9)+(H10*AC10)","v":4242.09}]
[null,"OP5M","P5TC",202304,"P",10000,1,1,4220.59,2,{"$f":"I8/G8","v":4220.59},-1.771E-3,{"$f":"+'Risk Arrays Options'!C34","v":29.00622971336437},{"$f":"+'Risk Arrays Options'!D34","v":-0.03},{"$f":"+'Risk Arrays Options'!E34","v":12.64126873867173},{"$f":"+'Risk Arrays Options'!F34","v":-0.03},{"$f":"+'Risk Arrays Options'!G34","v":65.397161971222715},{"$f":"+'Risk Arrays Options'!H34","v":-0.03},{"$f":"+'Risk Arrays Options'!I34","v":5.4429394208987212},{"$f":"+'Risk Arrays Options'!J34","v":-0.03},{"$f":"+'Risk Arrays Options'!K34","v":143.7125345796928},{"$f":"+'Risk Arrays Options'!L34","v":-0.03},{"$f":"+'Risk Arrays Options'!M34","v":2.3212149828506607},{"$f":"+'Risk Arrays Options'!N34","v":-0.03},{"$f":"+'Risk Arrays Options'!O34","v":304.51807479146976},{"$f":"+'Risk Arrays Options'!P34","v":-0.03},{"$f":"+'Risk Arrays Options'!Q34","v":-9.8999999999980944E-3},{"$f":"+'Risk Arrays Options'!R34","v":1940.5670265197721}]
[null,"OP5M","P5TC",202305,"P",10000,1,1,4220.59,2,{"$f":"I9/G9","v":4220.59},-7.3889999999999997E-3,{"$f":"+'Risk Arrays Options'!C44","v":199.28828704647128},{"$f":"+'Risk Arrays Options'!D44","v":-4.83},{"$f":"+'Risk Arrays Options'!E44","v":137.22777749165365},{"$f":"+'Risk Arrays Options'!F44","v":-4.83},{"$f":"+'Risk Arrays Options'!G44","v":289.2637104034896},{"$f":"+'Risk Arrays Options'!H44","v":-4.83},{"$f":"+'Risk Arrays Options'!I44","v":94.383942347162801},{"$f":"+'Risk Arrays Options'!J44","v":-4.83},{"$f":"+'Risk Arrays Options'!K44","v":419.5936302347011},{"$f":"+'Risk Arrays Options'!L44","v":-4.83},{"$f":"+'Risk Arrays Options'!M44","v":64.742938238214919},{"$f":"+'Risk Arrays Options'!N44","v":-4.83},{"$f":"+'Risk Arrays Options'!O44","v":607.7411590622728},{"$f":"+'Risk Arrays Options'!P44","v":-4.83},{"$f":"+'Risk Arrays Options'!Q44","v":-1.5938269051018108},{"$f":"+'Risk Arrays Options'!R44","v":1478.2195281112647}]
[null,"OP5M","P5TC",202306,"P",10000,1,1,4220.59,2,{"$f":"I10/G10","v":4220.59},-1.4102E-2,{"$f":"+'Risk Arrays Options'!C54","v":376.46027940029171},{"$f":"+'Risk Arrays Options'!D54","v":-16.64},{"$f":"+'Risk Arrays Options'!E54","v":285.32964382914815},{"$f":"+'Risk Arrays Options'!F54","v":-16.64},{"$f":"+'Risk Arrays Options'!G54","v":497.13001355918277},{"$f":"+'Risk Arrays Options'!H54","v":-16.64},{"$f":"+'Risk Arrays Options'!I54","v":216.29568717317414},{"$f":"+'Risk Arrays Options'!J54","v":-16.64},{"$f":"+'Risk Arrays Options'!K54","v":657.284943341239},{"$f":"+'Risk Arrays Options'!L54","v":-16.64},{"$f":"+'Risk Arrays Options'!M54","v":163.81395512465076},{"$f":"+'Risk Arrays Options'!N54","v":-16.64},{"$f":"+'Risk Arrays Options'!O54","v":870.10301289460369},{"$f":"+'Risk Arrays Options'!P54","v":-16.64},{"$f":"+'Risk Arrays Options'!Q54","v":-5.4869263384577485},{"$f":"+'Risk Arrays Options'!R54","v":1399.7065607794232}]
[null,"OP5M","P5TC",202307,"P",10000,1,1,1527.95,3,{"$f":"I11/G11","v":1527.95},-1.3018999999999999E-2,{"$f":"+'Risk Arrays Options'!C64","v":532.43353419750326},{"$f":"+'Risk Arrays Options'!D64","v":-26.39},{"$f":"+'Risk Arrays Options'!E64","v":488.89639059501417},{"$f":"+'Risk Arrays Options'!F64","v":-26.39},{"$f":"+'Risk Arrays Options'!G64","v":579.97971126159109},{"$f":"+'Risk Arrays Options'!H64","v":-26.39},{"$f":"+'Risk Arrays Options'!I64","v":449.01152350996023},{"$f":"+'Risk Arrays Options'!J64","v":-26.39},{"$f":"+'Risk Arrays Options'!K64","v":631.92746092092239},{"$f":"+'Risk Arrays Options'!L64","v":-26.39},{"$f":"+'Risk Arrays Options'!M64","v":412.45479992198108},{"$f":"+'Risk Arrays Options'!N64","v":-26.39},{"$f":"+'Risk Arrays Options'!O64","v":688.70849435799653},{"$f":"+'Risk Arrays Options'!P64","v":-26.39},{"$f":"+'Risk Arrays Options'!Q64","v":-7.918999143620514},{"$f":"+'Risk Arrays Options'!R64","v":67.16729413855856},{"$f":"IF(H11<0,MAX(M11:AB11),-1*MIN(M11:AB11))","v":26.39},{"$f":"H11*AC11","v":26.39}]
[null,null,null,null,null,null,null,null,null,null,null,null,{"$f":"$K12*$G12*M$3*M$5","v":0},0,0,0,0,0,0,0,0,0,0,0,0,0,0,0,{"$f":"IF(H12>0,MAX(M12:AB12),MIN(M12:AB12))","v":0},0]
[null,null,null,null,null,null,null,null,null,null,null,null,0,0,0,0,0,0,0,0,0,0,0,0,0,0,0,0,{"$f":"IF(H13>0,MAX(M13:AB13),MIN(M13:AB13))","v":0},0]
[null,null,null,null,null,null,null,null,null,null,null,null,0,0,0,0,0,0,0,0,0,0,0,0,0,0,0,0,{"$f":"IF(H14>0,MAX(M14:AB14),MIN(M14:AB14))","v":0},0]
[null,null,null,null,null,null,null,null,null,null,null,null,0,0,0,0,0,0,0,0,0,0,0,0,0,0,0,0,{"$f":"IF(H15>0,MAX(M15:AB15),MIN(M15:AB15))","v":0},0]
[null,null,null,null,null,null,null,null,null,null,null,null,0,0,0,0,0,0,0,0,0,0,0,0,0,0,0,0,{"$f":"IF(H16>0,MAX(M16:AB16),MIN(M16:AB16))","v":0},0]
[]
[null,null,null,null,null,null,null,null,null,null,null,"See 'Risk Arrays Options'."]

{"sheet":"Risk Arrays Options","index":6,"n_rows":64,"n_cols":18,"rows_kept":64,"cut":false,"hidden":true,"merged":[[1,1,1,5],[19,1,19,2]]}
[]
[null,"Option OP5M Characteristics"]
[null,null,202304,202305,202306,202307]
[null,"Contractvolume",1,1,1,1]
[null,"Underlying Price [S]",16761,18143,18365,18222]
[null,"Strike [K]",10000,10000,10000,10000]
[null,"Interest Rate [r]",4.999E-2,5.0880000000000002E-2,5.042E-2,5.042E-2]
[null,"Vola [Sigma]",0.49023600000000001,0.56535100000000005,0.54777500000000001,0.50017199999999995]
[null,"Time to Maturity [T]",{"$f":"19.177999/250","v":7.6711996000000005E-2},{"$f":"41.780751/250","v":0.16712300400000002},{"$f":"62.328748/250","v":0.24931499199999999},{"$f":"83.561748/250","v":0.33424699199999997}]
[null,"Scan Range",4220.59,4220.59,4220.59,1527.95]
[null,"Volatility Scan Range",0.5,0.5,0.5,0.5]
[null,"Look Ahead Time",3,3,3,3]
[null,"Composite Delta",-1.771E-3,-7.3889999999999997E-3,-1.4102E-2,-1.3018999999999999E-2]
[null,"Current Option Price (Calculation)",{"$f":"bsPut(C5,C6,C8,C7,C9)","v":2.9283904993578472E-2},{"$f":"bsPut(D5,D6,D8,D7,D9)","v":4.8267545981316289},16.652015991396311,26.370785826032087]
[null,"Current Option Price (SPAN)",0.03,4.83,16.64,26.39]
[null,"Current Option Value (Calculation)",{"$f":"C14*C4","v":2.9283904993578472E-2},{"$f":"D14*D4","v":4.8267545981316289},16.652015991396311,26.370785826032087]
[null,"Current Option Value (SPAN)",{"$f":"+C15*C4","v":0.03},{"$f":"+D15*D4","v":4.83},16.64,26.39]
[]
[]
[null,"Option OP5M Risk Array"]
{"$rows_left_out":45}
{"sheet":"Spreads","index":7,"n_rows":11,"n_cols":10,"rows_kept":11,"cut":false,"hidden":false,"merged":[[8,2,8,9],[1,2,1,4],[2,2,3,3]]}
[]
[null,null,"Portfolio Spread Matrix"]
[null,null,null,null,"Long"]
[null,null,null,null,"P5TC Tier3"]
[null,null,"Short","P5TC Tier2","Credit = 0.63 (Spread ID: 55369)"]
[]
[]
[]
[null,null,"Extract from Intercommodity Spread File"]
[null,null,"Spread_ID","Combined_Commodity_A","Tier_A","Combined_Commodity_B","Tier_B","RatioA","RatioB","Spread Credit"]
[null,null,55369,"P5TC",2,"P5TC",3,1527.9534659249662,4220.59,0.62590000000000001]

{"sheet":"Intracommodity Credits","index":8,"n_rows":17,"n_cols":23,"rows_kept":17,"cut":false,"hidden":false,"merged":[[11,18,11,20],[4,1,5,1],[4,3,5,3],[4,4,5,4],[1,2,1,3],[4,20,5,20],[9,1,10,1],[9,14,10,14],[9,16,10,16],[4,22,5,22],[9,3,10,3],[4,15,5,15],[4,16,5,16],[4,18,5,18],[4,12,5,12],[4,13,5,13],[4,14,5,14],[4,21,5,21],[4,19,5,19],[4,17,5,17]]}
[]
[null,null,"ECC Technical Scaling Factor",null,100]
[]
[null,null,"Product","Combined Commodity","Tier","Call/Put","Strike Price","Contract Volume","Net Position","Scanning Range","SMP","Composite Delta","Original Delta (Net)","Scan Risk","Short Option Minimum","Ratio","Spread Credit","Intracommodity Charge","Number of Spreads","Intracommodity Credit","Intercommodity Credit","SPAN Requirement","Remaining Delta"]
[null,"Intra Tiers ","P5TC","P5TC","Tier 3",null,null,1,100,{"$f":"+Tiers!G8","v":1527.9534659249662},{"$f":"+J5/H5","v":1527.9534659249662},1,{"$f":"((L5*I5*H5)+(L6*I6*H6))/$E$2","v":0.25},{"$f":"+'Risk Arrays and Scan Risk'!AD8","v":38198.836648124154},null,null,null,{"$f":"+Tiers!H8","v":1263.2403712460732},{"$f":"+MIN(ABS(I5),ABS(I6))","v":75},{"$f":"+S5*R5","v":94743.027843455493},null,{"$f":"+ROUND((T5+N5)/100,2)*100","v":132942},{"$f":"+M5","v":0.25}]
[null,null,"P5TC",null,null,null,null,1,-75,{"$f":"+Tiers!G11","v":1527.9534659249662},{"$f":"+J6/H6","v":1527.9534659249662},1]
[]
[]
[]
[null,"Consolidation Combined Commodity","P5TC","P5TC","Tier 2",null,null,1,-50,{"$f":"+'Risk Arrays and Scan Risk'!J7","v":4220.5941585656583},{"$f":"+J10/H10","v":4220.5941585656583},1,{"$f":"(L10*I10*H10)/$E$2","v":-0.5},{"$f":"+'Risk Arrays and Scan Risk'!AD7","v":211029.70792828291},null,{"$f":"+J11","v":1527.9534659249662},{"$f":"+Spreads!J11","v":0.62590000000000001},null,{"$f":"IF(M10*M11<0,ABS(M10/P10),0)","v":3.2723509658543078E-4},null,{"$f":"K10*P10*$E$2*Q10*MIN($S$10:$S$11)","v":23908.651858060908},{"$f":"N10-U10","v":187121.056070222},{"$f":"M10-SIGN(M10)*P10*MIN(S10:S11)","v":-0.40949417259036869}]
[null,null,"P5TC",null,"Tier 3",null,null,1,25,{"$f":"+'Risk Arrays and Scan Risk'!J8","v":1527.9534659249662},{"$f":"+J11/H11","v":1527.9534659249662},1,{"$f":"(L11*I11*H11)/$E$2","v":0.25},{"$f":"+'Risk Arrays and Scan Risk'!AD8","v":38198.836648124154},null,{"$f":"+K10","v":4220.5941585656583},null,null,{"$f":"IF(M10*M11<0,ABS(M11/P11),0)","v":5.9233366347870056E-5},null,{"$f":"K11*P11*$E$2*Q10*MIN($S$10:$S$11)","v":23908.651858060908},{"$f":"+N11-U11","v":14290.184790063246},{"$f":"M11-SIGN(M11)*P11*MIN(S10:S11)","v":0}]
[null,null,null,null,null,null,null,null,null,null,null,null,null,null,null,null,null,null,"SPAN Margin",null,null,{"$f":"T5+V10+V11","v":296154.26870374073}]
[]
[]
[]
[]
[null,null,null,null,null,null,null,null,null," "]