{"text_format":"1","workbook":"xlsx","n_sheets":4,"sheets":["Calculation","Parameter","Calendar","Disclaimer"],"not_rendered":{"charts":0,"images":1,"macros":0,"external_links":1,"defined_names":69,"comments":0,"pivot_tables":0},"unopened":[],"bounds":{"document_bytes":16777216,"sheet_cells":100000,"rows_first":2000,"rows_last":500,"rows_between":2000,"halvings":0,"cell_chars":16384,"cell_head_chars":4096},"cells_cut":0,"cells_raw":0,"read":"whole","date_system":"1900"}

{"sheet":"Calculation","index":0,"n_rows":510,"n_cols":13,"rows_kept":510,"cut":false,"hidden":false,"merged":[[5,3,5,4],[4,3,4,8]]}
[]
[]
[null,null,null,null,null,null,null,"With Holiday Adjustment?","YES","standard: YES"]
[]
[null,null,null,"IMSM Margin Calculator Example V 3.3.1"]
[null,null,null,"valid from: 2025-12-08"]
[]
[]
[]
["Date","Exposure","T0Exposure",{"$f":"\"Exposure > \" & minIMSM & \" EUR\"","v":"Exposure > 0 EUR"},"number of Exposures > 0","Weighted Mean","Weighted Standard Deviation (SD)","Mean + alpha * SD","Statistical Component","beta * Max (T-30 to T)","Scaling Factor\n(Holiday Adjustment)","IMSM Requirement"]
[{"$f":"IF($A$12=\"\",\"\",OFFSET(Calendar!$A$1,VLOOKUP(Calculation!$A$12,Calendar!$A$2:$C$1825,2,FALSE)+1,0))","v":"2025-10-02"},null,null,null,{"$f":"COUNTIF($D13:$D262,\">0\")","v":214},{"$f":"IF($A11=\"\",\"\",IF(E11=0,0,SUMPRODUCT($D13:$D262,Parameter!$B$14:$B$263)/E11))","v":371253.96106131736},{"$f":"IF($A11=\"\",\"\",IF(E11=0,0,SQRT(SUMPRODUCT(IF($D13:$D262>0,(($D13:$D262)-$F11)^2,0),Parameter!$B$14:$B$263)/E11)))","v":509196.9178914504},{"$f":"IF($A11=\"\",\"\",F11+alpha*G11)","v":2306202.2490488286},{"$f":"IF($A11=\"\",\"\",IF($D13>0,$H11,MIN($H11,I12)))","v":2306202.2490488286},{"$f":"IF($A11=\"\",\"\",beta*MAX(0,C12,INDIRECT(\"B\" & ROW(A13) & \":B\" &  ROW(A13) + window_size_max-2)))","v":4444297.6000000006},{"$f":"IF($A12=\"\",\"\",IF($I$3=\"YES\",VLOOKUP(OFFSET(A12,M11,0),Calendar!$A$2:$C$10000,3,FALSE),1))","v":1},{"$f":"IF(A12=\"\",\"\",IF(VLOOKUP(A11,Calendar!A:E,5,FALSE)=0,\"\",CEILING(K11*CEILING(MAX(OFFSET(J11,M11,0),OFFSET(I11,M11,0)),roundto),roundto)+add_margin))","v":4500000},{"$f":"IF(INDIRECT(\"Calendar!E\"&MATCH($A11,Calendar!A:A,0)-1),0,IF(INDIRECT(\"Calendar!E\"&MATCH($A11,Calendar!A:A,0)-2),1,2))","v":0}]
["2025-10-01",323440,240947,{"$f":"IF(B12>minIMSM,B12,minIMSM)","v":323440},{"$f":"COUNTIF($D14:$D263,\">0\")","v":214},{"$f":"IF($A12=\"\",\"\",IF(E12=0,0,SUMPRODUCT($D14:$D263,Parameter!$B$14:$B$263)/E12))","v":372841.22403667017},{"$f":"IF($A12=\"\",\"\",IF(E12=0,0,SQRT(SUMPRODUCT(IF($D14:$D263>0,(($D14:$D263)-$F12)^2,0),Parameter!$B$14:$B$263)/E12)))","v":511177.37967762712},2315315.266811653,{"$f":"IF($A12=\"\",\"\",IF($D14>0,$H12,MIN($H12,I13)))","v":2315315.266811653},4444297.6000000006,{"$f":"IF($A13=\"\",\"\",IF($I$3=\"YES\",VLOOKUP(OFFSET(A13,M12,0),Calendar!$A$2:$C$10000,3,FALSE),1))","v":1},{"$f":"IF(A13=\"\",\"\",IF(VLOOKUP(A12,Calendar!A:E,5,FALSE)=0,\"\",CEILING(K12*CEILING(MAX(OFFSET(J12,M12,0),OFFSET(I12,M12,0)),roundto),roundto)+add_margin))","v":4500000},{"$f":"IF(INDIRECT(\"Calendar!E\"&MATCH($A12,Calendar!A:A,0)-1),0,IF(INDIRECT(\"Calendar!E\"&MATCH($A12,Calendar!A:A,0)-2),1,2))","v":0}]
["2025-09-30",566967,326020,566967,214,{"$f":"IF($A13=\"\",\"\",IF(E13=0,0,SUMPRODUCT($D15:$D264,Parameter!$B$14:$B$263)/E13))","v":375436.63651721395},{"$f":"IF($A13=\"\",\"\",IF(E13=0,0,SQRT(SUMPRODUCT(IF($D15:$D264>0,(($D15:$D264)-$F13)^2,0),Parameter!$B$14:$B$263)/E13)))","v":512769.28259541828},2323959.9103798033,2323959.9103798033,4444297.6000000006,{"$f":"IF($A14=\"\",\"\",IF($I$3=\"YES\",VLOOKUP(OFFSET(A14,M13,0),Calendar!$A$2:$C$10000,3,FALSE),1))","v":1},{"$f":"IF(A14=\"\",\"\",IF(VLOOKUP(A13,Calendar!A:E,5,FALSE)=0,\"\",CEILING(K13*CEILING(MAX(OFFSET(J13,M13,0),OFFSET(I13,M13,0)),roundto),roundto)+add_margin))","v":4500000},{"$f":"IF(INDIRECT(\"Calendar!E\"&MATCH($A13,Calendar!A:A,0)-1),0,IF(INDIRECT(\"Calendar!E\"&MATCH($A13,Calendar!A:A,0)-2),1,2))","v":0}]
["2025-09-29",340789,56745,340789,215,{"$f":"IF($A14=\"\",\"\",IF(E14=0,0,SUMPRODUCT($D16:$D265,Parameter!$B$14:$B$263)/E14))","v":377600.11379416881},{"$f":"IF($A14=\"\",\"\",IF(E14=0,0,SQRT(SUMPRODUCT(IF($D16:$D265>0,(($D16:$D265)-$F14)^2,0),Parameter!$B$14:$B$263)/E14)))","v":513167.483557923},2327636.5513142762,2327636.5513142762,4444297.6000000006,{"$f":"IF($A15=\"\",\"\",IF($I$3=\"YES\",VLOOKUP(OFFSET(A15,M14,0),Calendar!$A$2:$C$10000,3,FALSE),1))","v":1},{"$f":"IF(A15=\"\",\"\",IF(VLOOKUP(A14,Calendar!A:E,5,FALSE)=0,\"\",CEILING(K14*CEILING(MAX(OFFSET(J14,M14,0),OFFSET(I14,M14,0)),roundto),roundto)+add_margin))","v":4500000},{"$f":"IF(INDIRECT(\"Calendar!E\"&MATCH($A14,Calendar!A:A,0)-1),0,IF(INDIRECT(\"Calendar!E\"&MATCH($A14,Calendar!A:A,0)-2),1,2))","v":0}]
["2025-09-26",-3109,40545,0,215,{"$f":"IF($A15=\"\",\"\",IF(E15=0,0,SUMPRODUCT($D17:$D266,Parameter!$B$14:$B$263)/E15))","v":376836.61496078141},{"$f":"IF($A15=\"\",\"\",IF(E15=0,0,SQRT(SUMPRODUCT(IF($D17:$D266>0,(($D17:$D266)-$F15)^2,0),Parameter!$B$14:$B$263)/E15)))","v":514263.62506372953},2331038.3902029535,2331038.3902029535,4444297.6000000006,{"$f":"IF($A16=\"\",\"\",IF($I$3=\"YES\",VLOOKUP(OFFSET(A16,M15,0),Calendar!$A$2:$C$10000,3,FALSE),1))","v":1},{"$f":"IF(A16=\"\",\"\",IF(VLOOKUP(A15,Calendar!A:E,5,FALSE)=0,\"\",CEILING(K15*CEILING(MAX(OFFSET(J15,M15,0),OFFSET(I15,M15,0)),roundto),roundto)+add_margin))","v":4500000},{"$f":"IF(INDIRECT(\"Calendar!E\"&MATCH($A15,Calendar!A:A,0)-1),0,IF(INDIRECT(\"Calendar!E\"&MATCH($A15,Calendar!A:A,0)-2),1,2))","v":0}]
["2025-09-25",1015000,1029335,1015000,215,{"$f":"IF($A16=\"\",\"\",IF(E16=0,0,SUMPRODUCT($D18:$D267,Parameter!$B$14:$B$263)/E16))","v":375527.06276762334},{"$f":"IF($A16=\"\",\"\",IF(E16=0,0,SQRT(SUMPRODUCT(IF($D18:$D267>0,(($D18:$D267)-$F16)^2,0),Parameter!$B$14:$B$263)/E16)))","v":514946.7110951544},2332324.5649292101,2332324.5649292101,4444297.6000000006,{"$f":"IF($A17=\"\",\"\",IF($I$3=\"YES\",VLOOKUP(OFFSET(A17,M16,0),Calendar!$A$2:$C$10000,3,FALSE),1))","v":1},{"$f":"IF(A17=\"\",\"\",IF(VLOOKUP(A16,Calendar!A:E,5,FALSE)=0,\"\",CEILING(K16*CEILING(MAX(OFFSET(J16,M16,0),OFFSET(I16,M16,0)),roundto),roundto)+add_margin))","v":4500000},{"$f":"IF(INDIRECT(\"Calendar!E\"&MATCH($A16,Calendar!A:A,0)-1),0,IF(INDIRECT(\"Calendar!E\"&MATCH($A16,Calendar!A:A,0)-2),1,2))","v":0}]
["2025-09-24",1121777,252812,1121777,215,{"$f":"IF($A17=\"\",\"\",IF(E17=0,0,SUMPRODUCT($D19:$D268,Parameter!$B$14:$B$263)/E17))","v":369497.66061420308},{"$f":"IF($A17=\"\",\"\",IF(E17=0,0,SQRT(SUMPRODUCT(IF($D19:$D268>0,(($D19:$D268)-$F17)^2,0),Parameter!$B$14:$B$263)/E17)))","v":505663.03230462217},2291017.1833717674,2291017.1833717674,4444297.6000000006,{"$f":"IF($A18=\"\",\"\",IF($I$3=\"YES\",VLOOKUP(OFFSET(A18,M17,0),Calendar!$A$2:$C$10000,3,FALSE),1))","v":1},{"$f":"IF(A18=\"\",\"\",IF(VLOOKUP(A17,Calendar!A:E,5,FALSE)=0,\"\",CEILING(K17*CEILING(MAX(OFFSET(J17,M17,0),OFFSET(I17,M17,0)),roundto),roundto)+add_margin))","v":4500000},{"$f":"IF(INDIRECT(\"Calendar!E\"&MATCH($A17,Calendar!A:A,0)-1),0,IF(INDIRECT(\"Calendar!E\"&MATCH($A17,Calendar!A:A,0)-2),1,2))","v":0}]
["2025-09-23",2167612,2048958,2167612,215,{"$f":"IF($A18=\"\",\"\",IF(E18=0,0,SUMPRODUCT($D20:$D269,Parameter!$B$14:$B$263)/E18))","v":360566.5818236756},{"$f":"IF($A18=\"\",\"\",IF(E18=0,0,SQRT(SUMPRODUCT(IF($D20:$D269>0,(($D20:$D269)-$F18)^2,0),Parameter!$B$14:$B$263)/E18)))","v":485081.17119315319},2203875.0323576578,2203875.0323576578,2520105.6,{"$f":"IF($A19=\"\",\"\",IF($I$3=\"YES\",VLOOKUP(OFFSET(A19,M18,0),Calendar!$A$2:$C$10000,3,FALSE),1))","v":1},{"$f":"IF(A19=\"\",\"\",IF(VLOOKUP(A18,Calendar!A:E,5,FALSE)=0,\"\",CEILING(K18*CEILING(MAX(OFFSET(J18,M18,0),OFFSET(I18,M18,0)),roundto),roundto)+add_margin))","v":2580000},{"$f":"IF(INDIRECT(\"Calendar!E\"&MATCH($A18,Calendar!A:A,0)-1),0,IF(INDIRECT(\"Calendar!E\"&MATCH($A18,Calendar!A:A,0)-2),1,2))","v":0}]
["2025-09-22",2777686,861622,2777686,215,{"$f":"IF($A19=\"\",\"\",IF(E19=0,0,SUMPRODUCT($D21:$D270,Parameter!$B$14:$B$263)/E19))","v":359117.14549796353},{"$f":"IF($A19=\"\",\"\",IF(E19=0,0,SQRT(SUMPRODUCT(IF($D21:$D270>0,(($D21:$D270)-$F19)^2,0),Parameter!$B$14:$B$263)/E19)))","v":485252.2361444796},2203075.6428469857,2203075.6428469857,2783016,{"$f":"IF($A20=\"\",\"\",IF($I$3=\"YES\",VLOOKUP(OFFSET(A20,M19,0),Calendar!$A$2:$C$10000,3,FALSE),1))","v":1},{"$f":"IF(A20=\"\",\"\",IF(VLOOKUP(A19,Calendar!A:E,5,FALSE)=0,\"\",CEILING(K19*CEILING(MAX(OFFSET(J19,M19,0),OFFSET(I19,M19,0)),roundto),roundto)+add_margin))","v":2840000},{"$f":"IF(INDIRECT(\"Calendar!E\"&MATCH($A19,Calendar!A:A,0)-1),0,IF(INDIRECT(\"Calendar!E\"&MATCH($A19,Calendar!A:A,0)-2),1,2))","v":0}]
["2025-09-19",1149197,421528,1149197,215,{"$f":"IF($A20=\"\",\"\",IF(E20=0,0,SUMPRODUCT($D22:$D271,Parameter!$B$14:$B$263)/E20))","v":357133.86792699451},{"$f":"IF($A20=\"\",\"\",IF(E20=0,0,SQRT(SUMPRODUCT(IF($D22:$D271>0,(($D22:$D271)-$F20)^2,0),Parameter!$B$14:$B$263)/E20)))","v":484769.05187412933},2199256.2650486859,2199256.2650486859,2783016,{"$f":"IF($A21=\"\",\"\",IF($I$3=\"YES\",VLOOKUP(OFFSET(A21,M20,0),Calendar!$A$2:$C$10000,3,FALSE),1))","v":1},{"$f":"IF(A21=\"\",\"\",IF(VLOOKUP(A20,Calendar!A:E,5,FALSE)=0,\"\",CEILING(K20*CEILING(MAX(OFFSET(J20,M20,0),OFFSET(I20,M20,0)),roundto),roundto)+add_margin))","v":2840000},{"$f":"IF(INDIRECT(\"Calendar!E\"&MATCH($A20,Calendar!A:A,0)-1),0,IF(INDIRECT(\"Calendar!E\"&MATCH($A20,Calendar!A:A,0)-2),1,2))","v":0}]
["2025-09-18",1257405,935896,1257405,215,{"$f":"IF($A21=\"\",\"\",IF(E21=0,0,SUMPRODUCT($D23:$D272,Parameter!$B$14:$B$263)/E21))","v":355001.62597453775},{"$f":"IF($A21=\"\",\"\",IF(E21=0,0,SQRT(SUMPRODUCT(IF($D23:$D272>0,(($D23:$D272)-$F21)^2,0),Parameter!$B$14:$B$263)/E21)))","v":484391.05305351631},2195687.6275778995,2195687.6275778995,2783016,{"$f":"IF($A22=\"\",\"\",IF($I$3=\"YES\",VLOOKUP(OFFSET(A22,M21,0),Calendar!$A$2:$C$10000,3,FALSE),1))","v":1},{"$f":"IF(A22=\"\",\"\",IF(VLOOKUP(A21,Calendar!A:E,5,FALSE)=0,\"\",CEILING(K21*CEILING(MAX(OFFSET(J21,M21,0),OFFSET(I21,M21,0)),roundto),roundto)+add_margin))","v":2840000},{"$f":"IF(INDIRECT(\"Calendar!E\"&MATCH($A21,Calendar!A:A,0)-1),0,IF(INDIRECT(\"Calendar!E\"&MATCH($A21,Calendar!A:A,0)-2),1,2))","v":0}]
["2025-09-17",1248066,628424,1248066,215,{"$f":"IF($A22=\"\",\"\",IF(E22=0,0,SUMPRODUCT($D24:$D273,Parameter!$B$14:$B$263)/E22))","v":353562.04228613933},{"$f":"IF($A22=\"\",\"\",IF(E22=0,0,SQRT(SUMPRODUCT(IF($D24:$D273>0,(($D24:$D273)-$F22)^2,0),Parameter!$B$14:$B$263)/E22)))","v":484810.75209052121},2195842.9002301199,2195842.9002301199,2783016,{"$f":"IF($A23=\"\",\"\",IF($I$3=\"YES\",VLOOKUP(OFFSET(A23,M22,0),Calendar!$A$2:$C$10000,3,FALSE),1))","v":1},{"$f":"IF(A23=\"\",\"\",IF(VLOOKUP(A22,Calendar!A:E,5,FALSE)=0,\"\",CEILING(K22*CEILING(MAX(OFFSET(J22,M22,0),OFFSET(I22,M22,0)),roundto),roundto)+add_margin))","v":2840000},{"$f":"IF(INDIRECT(\"Calendar!E\"&MATCH($A22,Calendar!A:A,0)-1),0,IF(INDIRECT(\"Calendar!E\"&MATCH($A22,Calendar!A:A,0)-2),1,2))","v":0}]
["2025-09-16",1102410,548039,1102410,215,{"$f":"IF($A23=\"\",\"\",IF(E23=0,0,SUMPRODUCT($D25:$D274,Parameter!$B$14:$B$263)/E23))","v":355194.12795404991},{"$f":"IF($A23=\"\",\"\",IF(E23=0,0,SQRT(SUMPRODUCT(IF($D25:$D274>0,(($D25:$D274)-$F23)^2,0),Parameter!$B$14:$B$263)/E23)))","v":486467.06409059238},2203768.9714983008,2203768.9714983008,2783016,{"$f":"IF($A24=\"\",\"\",IF($I$3=\"YES\",VLOOKUP(OFFSET(A24,M23,0),Calendar!$A$2:$C$10000,3,FALSE),1))","v":1},{"$f":"IF(A24=\"\",\"\",IF(VLOOKUP(A23,Calendar!A:E,5,FALSE)=0,\"\",CEILING(K23*CEILING(MAX(OFFSET(J23,M23,0),OFFSET(I23,M23,0)),roundto),roundto)+add_margin))","v":2840000},{"$f":"IF(INDIRECT(\"Calendar!E\"&MATCH($A23,Calendar!A:A,0)-1),0,IF(INDIRECT(\"Calendar!E\"&MATCH($A23,Calendar!A:A,0)-2),1,2))","v":0}]
["2025-09-15",453305,19400,453305,215,{"$f":"IF($A24=\"\",\"\",IF(E24=0,0,SUMPRODUCT($D26:$D275,Parameter!$B$14:$B$263)/E24))","v":357602.72586725239},{"$f":"IF($A24=\"\",\"\",IF(E24=0,0,SQRT(SUMPRODUCT(IF($D26:$D275>0,(($D26:$D275)-$F24)^2,0),Parameter!$B$14:$B$263)/E24)))","v":487806.50298260618},2211267.4372011558,2211267.4372011558,2783016,{"$f":"IF($A25=\"\",\"\",IF($I$3=\"YES\",VLOOKUP(OFFSET(A25,M24,0),Calendar!$A$2:$C$10000,3,FALSE),1))","v":1},{"$f":"IF(A25=\"\",\"\",IF(VLOOKUP(A24,Calendar!A:E,5,FALSE)=0,\"\",CEILING(K24*CEILING(MAX(OFFSET(J24,M24,0),OFFSET(I24,M24,0)),roundto),roundto)+add_margin))","v":2840000},{"$f":"IF(INDIRECT(\"Calendar!E\"&MATCH($A24,Calendar!A:A,0)-1),0,IF(INDIRECT(\"Calendar!E\"&MATCH($A24,Calendar!A:A,0)-2),1,2))","v":0}]
["2025-09-12",293583,388371,293583,215,{"$f":"IF($A25=\"\",\"\",IF(E25=0,0,SUMPRODUCT($D27:$D276,Parameter!$B$14:$B$263)/E25))","v":358395.99203951698},{"$f":"IF($A25=\"\",\"\",IF(E25=0,0,SQRT(SUMPRODUCT(IF($D27:$D276>0,(($D27:$D276)-$F25)^2,0),Parameter!$B$14:$B$263)/E25)))","v":489507.45212901704},2218524.3101297817,2218524.3101297817,2783016,{"$f":"IF($A26=\"\",\"\",IF($I$3=\"YES\",VLOOKUP(OFFSET(A26,M25,0),Calendar!$A$2:$C$10000,3,FALSE),1))","v":1},{"$f":"IF(A26=\"\",\"\",IF(VLOOKUP(A25,Calendar!A:E,5,FALSE)=0,\"\",CEILING(K25*CEILING(MAX(OFFSET(J25,M25,0),OFFSET(I25,M25,0)),roundto),roundto)+add_margin))","v":2840000},{"$f":"IF(INDIRECT(\"Calendar!E\"&MATCH($A25,Calendar!A:A,0)-1),0,IF(INDIRECT(\"Calendar!E\"&MATCH($A25,Calendar!A:A,0)-2),1,2))","v":0}]
["2025-09-11",651970,432616,651970,215,{"$f":"IF($A26=\"\",\"\",IF(E26=0,0,SUMPRODUCT($D28:$D277,Parameter!$B$14:$B$263)/E26))","v":358050.43683871342},{"$f":"IF($A26=\"\",\"\",IF(E26=0,0,SQRT(SUMPRODUCT(IF($D28:$D277>0,(($D28:$D277)-$F26)^2,0),Parameter!$B$14:$B$263)/E26)))","v":490949.4836819754},2223658.47483022,2223658.47483022,2783016,{"$f":"IF($A27=\"\",\"\",IF($I$3=\"YES\",VLOOKUP(OFFSET(A27,M26,0),Calendar!$A$2:$C$10000,3,FALSE),1))","v":1},{"$f":"IF(A27=\"\",\"\",IF(VLOOKUP(A26,Calendar!A:E,5,FALSE)=0,\"\",CEILING(K26*CEILING(MAX(OFFSET(J26,M26,0),OFFSET(I26,M26,0)),roundto),roundto)+add_margin))","v":2840000},{"$f":"IF(INDIRECT(\"Calendar!E\"&MATCH($A26,Calendar!A:A,0)-1),0,IF(INDIRECT(\"Calendar!E\"&MATCH($A26,Calendar!A:A,0)-2),1,2))","v":0}]
["2025-09-10",862497,588877,862497,215,{"$f":"IF($A27=\"\",\"\",IF(E27=0,0,SUMPRODUCT($D29:$D278,Parameter!$B$14:$B$263)/E27))","v":356157.41692082444},{"$f":"IF($A27=\"\",\"\",IF(E27=0,0,SQRT(SUMPRODUCT(IF($D29:$D278>0,(($D29:$D278)-$F27)^2,0),Parameter!$B$14:$B$263)/E27)))","v":490580.26248161675},2220362.4143509679,2220362.4143509679,2783016,{"$f":"IF($A28=\"\",\"\",IF($I$3=\"YES\",VLOOKUP(OFFSET(A28,M27,0),Calendar!$A$2:$C$10000,3,FALSE),1))","v":1},{"$f":"IF(A28=\"\",\"\",IF(VLOOKUP(A27,Calendar!A:E,5,FALSE)=0,\"\",CEILING(K27*CEILING(MAX(OFFSET(J27,M27,0),OFFSET(I27,M27,0)),roundto),roundto)+add_margin))","v":2840000},{"$f":"IF(INDIRECT(\"Calendar!E\"&MATCH($A27,Calendar!A:A,0)-1),0,IF(INDIRECT(\"Calendar!E\"&MATCH($A27,Calendar!A:A,0)-2),1,2))","v":0}]
["2025-09-09",1253310,741357,1253310,215,{"$f":"IF($A28=\"\",\"\",IF(E28=0,0,SUMPRODUCT($D30:$D279,Parameter!$B$14:$B$263)/E28))","v":354942.38914850459},{"$f":"IF($A28=\"\",\"\",IF(E28=0,0,SQRT(SUMPRODUCT(IF($D30:$D279>0,(($D30:$D279)-$F28)^2,0),Parameter!$B$14:$B$263)/E28)))","v":491024.99223473662},2220837.3596405038,2220837.3596405038,2783016,{"$f":"IF($A29=\"\",\"\",IF($I$3=\"YES\",VLOOKUP(OFFSET(A29,M28,0),Calendar!$A$2:$C$10000,3,FALSE),1))","v":1},{"$f":"IF(A29=\"\",\"\",IF(VLOOKUP(A28,Calendar!A:E,5,FALSE)=0,\"\",CEILING(K28*CEILING(MAX(OFFSET(J28,M28,0),OFFSET(I28,M28,0)),roundto),roundto)+add_margin))","v":2840000},{"$f":"IF(INDIRECT(\"Calendar!E\"&MATCH($A28,Calendar!A:A,0)-1),0,IF(INDIRECT(\"Calendar!E\"&MATCH($A28,Calendar!A:A,0)-2),1,2))","v":0}]
["2025-09-08",1123881,533563,1123881,215,{"$f":"IF($A29=\"\",\"\",IF(E29=0,0,SUMPRODUCT($D31:$D280,Parameter!$B$14:$B$263)/E29))","v":355495.86144289235},{"$f":"IF($A29=\"\",\"\",IF(E29=0,0,SQRT(SUMPRODUCT(IF($D31:$D280>0,(($D31:$D280)-$F29)^2,0),Parameter!$B$14:$B$263)/E29)))","v":492715.77238847601},2227815.7965191011,2227815.7965191011,2783016,{"$f":"IF($A30=\"\",\"\",IF($I$3=\"YES\",VLOOKUP(OFFSET(A30,M29,0),Calendar!$A$2:$C$10000,3,FALSE),1))","v":1},{"$f":"IF(A30=\"\",\"\",IF(VLOOKUP(A29,Calendar!A:E,5,FALSE)=0,\"\",CEILING(K29*CEILING(MAX(OFFSET(J29,M29,0),OFFSET(I29,M29,0)),roundto),roundto)+add_margin))","v":2840000},{"$f":"IF(INDIRECT(\"Calendar!E\"&MATCH($A29,Calendar!A:A,0)-1),0,IF(INDIRECT(\"Calendar!E\"&MATCH($A29,Calendar!A:A,0)-2),1,2))","v":0}]
["2025-09-05",695014,474965,695014,215,{"$f":"IF($A30=\"\",\"\",IF(E30=0,0,SUMPRODUCT($D32:$D281,Parameter!$B$14:$B$263)/E30))","v":355295.39374681696},{"$f":"IF($A30=\"\",\"\",IF(E30=0,0,SQRT(SUMPRODUCT(IF($D32:$D281>0,(($D32:$D281)-$F30)^2,0),Parameter!$B$14:$B$263)/E30)))","v":494067.82323064475},2232753.1220232667,2232753.1220232667,2783016,{"$f":"IF($A31=\"\",\"\",IF($I$3=\"YES\",VLOOKUP(OFFSET(A31,M30,0),Calendar!$A$2:$C$10000,3,FALSE),1))","v":1},{"$f":"IF(A31=\"\",\"\",IF(VLOOKUP(A30,Calendar!A:E,5,FALSE)=0,\"\",CEILING(K30*CEILING(MAX(OFFSET(J30,M30,0),OFFSET(I30,M30,0)),roundto),roundto)+add_margin))","v":2840000},{"$f":"IF(INDIRECT(\"Calendar!E\"&MATCH($A30,Calendar!A:A,0)-1),0,IF(INDIRECT(\"Calendar!E\"&MATCH($A30,Calendar!A:A,0)-2),1,2))","v":0}]
{"$rows_left_out":481}
{"sheet":"Parameter","index":1,"n_rows":263,"n_cols":2,"rows_kept":263,"cut":false,"hidden":false,"merged":[]}
[]
["Window Size Statistic",250]
["Window Size Maximum",30]
["EWMA Factor",0.99]
["alpha",3.8]
["beta",1.6]
["minIMSM in EUR",0]
["roundto",10000]
["Additional Margin in EUR",50000]
[]
[]
[]
["k","lambda^k"]
[1,{"$f":"ewma_factor^A14","v":0.99}]
[2,0.98009999999999997]
[3,0.97029899999999991]
[4,0.96059600999999994]
[5,0.95099004989999991]
[6,0.94148014940099989]
[7,0.93206534790698992]
[8,0.92274469442791995]
[9,0.91351724748364072]
[10,0.9043820750088043]
[11,0.89533825425871627]
[12,0.88638487171612912]
[13,0.87752102299896773]
[14,0.86874581276897811]
[15,0.86005835464128833]
[16,0.85145777109487542]
[17,0.84294319338392665]
{"$rows_left_out":234}
{"sheet":"Calendar","index":2,"n_rows":1827,"n_cols":7,"rows_kept":1827,"cut":false,"hidden":false,"merged":[]}
["ECC Calendar ","index","Holiday Adjustment Scaling Factor","Flag Weekday","ECC Business Day","Rows Until Next Business Day","Days Until Business Day After Next BD"]
["2021-01-01",{"$f":"ROW(A2)-1","v":1},{"$f":"1+0.3*MAX(G2-4,0)","v":1},null,0,{"$f":"IF($E2=1,MATCH(1,INDIRECT(\"$E$\"&ROW($A2)+1&\":$E$2598\"),0),0)","v":0},{"$f":"IF($E2=1,INDIRECT(\"$A$\"&ROW($A2)+MATCH(1,INDIRECT(\"$E$\"&ROW($A2)+1+$F2&\":$E$2598\"),0)+$F2)-$A2,0)","v":0}]
["2021-01-04",{"$f":"ROW(A3)-1","v":2},{"$f":"1+0.3*MAX(G3-4,0)","v":1},{"$f":"IF(ABS(WEEKDAY($A3)-4)<=1,1,0)","v":0},1,{"$f":"IF($E3=1,MATCH(1,INDIRECT(\"$E$\"&ROW($A3)+1&\":$E$2598\"),0),0)","v":1},2]
["2021-01-05",3,1,1,1,1,2]
["2021-01-06",4,1,1,1,1,2]
["2021-01-07",5,1,1,1,1,4]
["2021-01-08",6,1,0,1,1,4]
["2021-01-11",7,1,0,1,1,2]
["2021-01-12",8,1,1,1,1,2]
["2021-01-13",9,1,1,1,1,2]
["2021-01-14",10,1,1,1,1,4]
["2021-01-15",11,1,0,1,1,4]
["2021-01-18",12,1,0,1,1,2]
["2021-01-19",13,1,1,1,1,2]
["2021-01-20",14,1,1,1,1,2]
["2021-01-21",15,1,1,1,1,4]
["2021-01-22",16,1,0,1,1,4]
["2021-01-25",17,1,0,1,1,2]
["2021-01-26",18,1,1,1,1,2]
["2021-01-27",19,1,1,1,1,2]
["2021-01-28",20,1,1,1,1,4]
["2021-01-29",21,1,0,1,1,4]
["2021-02-01",22,1,0,1,1,2]
["2021-02-02",23,1,1,1,1,2]
["2021-02-03",24,1,1,1,1,2]
["2021-02-04",25,1,1,1,1,4]
["2021-02-05",26,1,0,1,1,4]
["2021-02-08",27,1,0,1,1,2]
["2021-02-09",28,1,1,1,1,2]
["2021-02-10",29,1,1,1,1,2]
{"$rows_left_out":1798}
{"sheet":"Disclaimer","index":3,"n_rows":8,"n_cols":4,"rows_kept":8,"cut":false,"hidden":false,"merged":[[4,3,4,6],[5,3,5,4],[7,3,9,21]]}
[]
[]
[]
[]
[null,null,null,"Disclaimer"]
[null,null,null,"last update: 2025-03-06"]
[]
[null,null,null,"This tool is only a service for recalculating the Initial Margin Spot Market.\n Although the tool was constructed with greatest diligence, errors, rounding errors and therefore deviations from the productive process cannot be excluded. In cases of doubt, the calculated value of the IMSM programm shall prevail. The disclaimer at\nhttp://www.ecc.de/ecc-en/extras/disclaimer shall apply to the use of this tool as well.\n"]