{"text_format":"1","workbook":"xlsx","n_sheets":4,"sheets":["Calculation","Parameter","Calendar","Disclaimer"],"not_rendered":{"charts":0,"images":1,"macros":1,"external_links":1,"defined_names":69,"comments":0,"pivot_tables":0},"unopened":[],"bounds":{"document_bytes":16777216,"sheet_cells":100000,"rows_first":2000,"rows_last":500,"rows_between":2000,"halvings":0,"cell_chars":16384,"cell_head_chars":4096},"cells_cut":0,"cells_raw":0,"read":"whole","date_system":"1900"}

{"sheet":"Calculation","index":0,"n_rows":510,"n_cols":13,"rows_kept":510,"cut":false,"hidden":false,"merged":[[5,3,5,4],[4,3,4,7]]}
[]
[]
[null,null,null,null,null,null,"With Holiday Adjustment?","YES","standard: YES"]
[]
[null,null,null,"IMSM Margin Calculator Example V 3.2.2"]
[null,null,null,"valid from: 2025-03-06"]
[]
[]
[]
["Date","Exposure","T0Exposure",{"$f":"\"Exposure > \" & minIMSM & \" EUR\"","v":"Exposure > 0 EUR"},{"$f":"\"T0Exposure > \" & minIMSM & \" EUR\"","v":"T0Exposure > 0 EUR"},"Mean","Standard Deviation (SD)","Number of datapoints","Mean + alpha * SD","beta * Max (T-30 to T)","Scaling Factor\n(Holiday Adjustment)","IMSM Requirement"]
[{"$f":"IF($A$12=\"\",\"\",OFFSET(Calendar!$A$1,VLOOKUP(Calculation!$A$12,Calendar!$A$2:$C$1825,2,FALSE)+1,0))","v":"2025-10-02"},null,null,null,{"$f":"IF(C11>minIMSM,C11,\"\")","v":""},{"$f":"IF($A11=\"\",\"\",IFERROR((AVERAGE(E12,INDIRECT(\"D\" & ROW(A13) & \":D\" &  ROW(A13) + window_size-2))),0))","v":883471.36915887846},563305.9666573432,214,{"$f":"IF($A11=\"\",\"\",F11+alpha*G11)","v":1897422.1091420962},{"$f":"IF($A11=\"\",\"\",beta*MAX(E12,INDIRECT(\"B\" & ROW(A13) & \":B\" &  ROW(A13) + window_size_max-2)))","v":4444297.6000000006},{"$f":"IF($A12=\"\",\"\",IF($H$3=\"YES\",VLOOKUP(OFFSET(A12,M11,0),Calendar!$A$2:$C$10000,3,FALSE),1))","v":1},{"$f":"IF(A12=\"\",\"\",IF(VLOOKUP(A11,Calendar!A:E,5,FALSE)=0,\"\",CEILING(K11*CEILING(MAX(OFFSET(J11,M11,0),OFFSET(I11,M11,0)),roundto),roundto)+add_margin))","v":4500000},{"$f":"IF(INDIRECT(\"Calendar!E\"&MATCH($A11,Calendar!A:A,0)-1),0,IF(INDIRECT(\"Calendar!E\"&MATCH($A11,Calendar!A:A,0)-2),1,2))","v":0}]
["2025-10-01",323440,240947,{"$f":"IF(B12>minIMSM,B12,\"\")","v":323440},240947,{"$f":"IF($A12=\"\",\"\",IFERROR((AVERAGE(E13,INDIRECT(\"D\" & ROW(A14) & \":D\" &  ROW(A14) + window_size-2))),0))","v":882945.80841121497},564454.88230294641,214,1898964.5965565187,4444297.6000000006,{"$f":"IF($A13=\"\",\"\",IF($H$3=\"YES\",VLOOKUP(OFFSET(A13,M12,0),Calendar!$A$2:$C$10000,3,FALSE),1))","v":1},{"$f":"IF(A13=\"\",\"\",IF(VLOOKUP(A12,Calendar!A:E,5,FALSE)=0,\"\",CEILING(K12*CEILING(MAX(OFFSET(J12,M12,0),OFFSET(I12,M12,0)),roundto),roundto)+add_margin))","v":4500000},{"$f":"IF(INDIRECT(\"Calendar!E\"&MATCH($A12,Calendar!A:A,0)-1),0,IF(INDIRECT(\"Calendar!E\"&MATCH($A12,Calendar!A:A,0)-2),1,2))","v":0}]
["2025-09-30",566967,326020,566967,326020,886098.13084112154,567824.86169251997,214,1908182.8818876576,4444297.6000000006,{"$f":"IF($A14=\"\",\"\",IF($H$3=\"YES\",VLOOKUP(OFFSET(A14,M13,0),Calendar!$A$2:$C$10000,3,FALSE),1))","v":1},{"$f":"IF(A14=\"\",\"\",IF(VLOOKUP(A13,Calendar!A:E,5,FALSE)=0,\"\",CEILING(K13*CEILING(MAX(OFFSET(J13,M13,0),OFFSET(I13,M13,0)),roundto),roundto)+add_margin))","v":4500000},{"$f":"IF(INDIRECT(\"Calendar!E\"&MATCH($A13,Calendar!A:A,0)-1),0,IF(INDIRECT(\"Calendar!E\"&MATCH($A13,Calendar!A:A,0)-2),1,2))","v":0}]
["2025-09-29",340789,56745,340789,56745,887080.98139534879,567655.77741018299,215,1908861.3807336781,4444297.6000000006,{"$f":"IF($A15=\"\",\"\",IF($H$3=\"YES\",VLOOKUP(OFFSET(A15,M14,0),Calendar!$A$2:$C$10000,3,FALSE),1))","v":1},{"$f":"IF(A15=\"\",\"\",IF(VLOOKUP(A14,Calendar!A:E,5,FALSE)=0,\"\",CEILING(K14*CEILING(MAX(OFFSET(J14,M14,0),OFFSET(I14,M14,0)),roundto),roundto)+add_margin))","v":4500000},{"$f":"IF(INDIRECT(\"Calendar!E\"&MATCH($A14,Calendar!A:A,0)-1),0,IF(INDIRECT(\"Calendar!E\"&MATCH($A14,Calendar!A:A,0)-2),1,2))","v":0}]
["2025-09-26",-3109,40545,"",40545,888625.07441860461,563442.80349904834,215,1902822.1207168917,4444297.6000000006,{"$f":"IF($A16=\"\",\"\",IF($H$3=\"YES\",VLOOKUP(OFFSET(A16,M15,0),Calendar!$A$2:$C$10000,3,FALSE),1))","v":1},{"$f":"IF(A16=\"\",\"\",IF(VLOOKUP(A15,Calendar!A:E,5,FALSE)=0,\"\",CEILING(K15*CEILING(MAX(OFFSET(J15,M15,0),OFFSET(I15,M15,0)),roundto),roundto)+add_margin))","v":4500000},{"$f":"IF(INDIRECT(\"Calendar!E\"&MATCH($A15,Calendar!A:A,0)-1),0,IF(INDIRECT(\"Calendar!E\"&MATCH($A15,Calendar!A:A,0)-2),1,2))","v":0}]
["2025-09-25",1015000,1029335,1015000,1029335,881563.49302325584,570761.72444685607,215,1908934.5970275968,4444297.6000000006,{"$f":"IF($A17=\"\",\"\",IF($H$3=\"YES\",VLOOKUP(OFFSET(A17,M16,0),Calendar!$A$2:$C$10000,3,FALSE),1))","v":1},{"$f":"IF(A17=\"\",\"\",IF(VLOOKUP(A16,Calendar!A:E,5,FALSE)=0,\"\",CEILING(K16*CEILING(MAX(OFFSET(J16,M16,0),OFFSET(I16,M16,0)),roundto),roundto)+add_margin))","v":4500000},{"$f":"IF(INDIRECT(\"Calendar!E\"&MATCH($A16,Calendar!A:A,0)-1),0,IF(INDIRECT(\"Calendar!E\"&MATCH($A16,Calendar!A:A,0)-2),1,2))","v":0}]
["2025-09-24",1121777,252812,1121777,252812,881088.97209302324,567297.91476235515,215,1902225.2186652627,4444297.6000000006,{"$f":"IF($A18=\"\",\"\",IF($H$3=\"YES\",VLOOKUP(OFFSET(A18,M17,0),Calendar!$A$2:$C$10000,3,FALSE),1))","v":1},{"$f":"IF(A18=\"\",\"\",IF(VLOOKUP(A17,Calendar!A:E,5,FALSE)=0,\"\",CEILING(K17*CEILING(MAX(OFFSET(J17,M17,0),OFFSET(I17,M17,0)),roundto),roundto)+add_margin))","v":4500000},{"$f":"IF(INDIRECT(\"Calendar!E\"&MATCH($A17,Calendar!A:A,0)-1),0,IF(INDIRECT(\"Calendar!E\"&MATCH($A17,Calendar!A:A,0)-2),1,2))","v":0}]
["2025-09-23",2167612,2048958,2167612,2048958,865846.07441860461,520192.51223230507,215,1802192.5964367539,2520105.6,{"$f":"IF($A19=\"\",\"\",IF($H$3=\"YES\",VLOOKUP(OFFSET(A19,M18,0),Calendar!$A$2:$C$10000,3,FALSE),1))","v":1},{"$f":"IF(A19=\"\",\"\",IF(VLOOKUP(A18,Calendar!A:E,5,FALSE)=0,\"\",CEILING(K18*CEILING(MAX(OFFSET(J18,M18,0),OFFSET(I18,M18,0)),roundto),roundto)+add_margin))","v":2580000},{"$f":"IF(INDIRECT(\"Calendar!E\"&MATCH($A18,Calendar!A:A,0)-1),0,IF(INDIRECT(\"Calendar!E\"&MATCH($A18,Calendar!A:A,0)-2),1,2))","v":0}]
["2025-09-22",2777686,861622,2777686,861622,861613.36279069772,524586.040625002,215,1805868.2359157014,2783016,{"$f":"IF($A20=\"\",\"\",IF($H$3=\"YES\",VLOOKUP(OFFSET(A20,M19,0),Calendar!$A$2:$C$10000,3,FALSE),1))","v":1},{"$f":"IF(A20=\"\",\"\",IF(VLOOKUP(A19,Calendar!A:E,5,FALSE)=0,\"\",CEILING(K19*CEILING(MAX(OFFSET(J19,M19,0),OFFSET(I19,M19,0)),roundto),roundto)+add_margin))","v":2840000},{"$f":"IF(INDIRECT(\"Calendar!E\"&MATCH($A19,Calendar!A:A,0)-1),0,IF(INDIRECT(\"Calendar!E\"&MATCH($A19,Calendar!A:A,0)-2),1,2))","v":0}]
["2025-09-19",1149197,421528,1149197,421528,861285.72558139532,523582.20445731631,215,1803733.6936045648,2783016,{"$f":"IF($A21=\"\",\"\",IF($H$3=\"YES\",VLOOKUP(OFFSET(A21,M20,0),Calendar!$A$2:$C$10000,3,FALSE),1))","v":1},{"$f":"IF(A21=\"\",\"\",IF(VLOOKUP(A20,Calendar!A:E,5,FALSE)=0,\"\",CEILING(K20*CEILING(MAX(OFFSET(J20,M20,0),OFFSET(I20,M20,0)),roundto),roundto)+add_margin))","v":2840000},{"$f":"IF(INDIRECT(\"Calendar!E\"&MATCH($A20,Calendar!A:A,0)-1),0,IF(INDIRECT(\"Calendar!E\"&MATCH($A20,Calendar!A:A,0)-2),1,2))","v":0}]
["2025-09-18",1257405,935896,1257405,935896,856982.76744186052,525662.72500511503,215,1803175.6724510677,2783016,{"$f":"IF($A22=\"\",\"\",IF($H$3=\"YES\",VLOOKUP(OFFSET(A22,M21,0),Calendar!$A$2:$C$10000,3,FALSE),1))","v":1},{"$f":"IF(A22=\"\",\"\",IF(VLOOKUP(A21,Calendar!A:E,5,FALSE)=0,\"\",CEILING(K21*CEILING(MAX(OFFSET(J21,M21,0),OFFSET(I21,M21,0)),roundto),roundto)+add_margin))","v":2840000},{"$f":"IF(INDIRECT(\"Calendar!E\"&MATCH($A21,Calendar!A:A,0)-1),0,IF(INDIRECT(\"Calendar!E\"&MATCH($A21,Calendar!A:A,0)-2),1,2))","v":0}]
["2025-09-17",1248066,628424,1248066,628424,852287.02790697676,529210.43425764481,215,1804865.8095707374,2783016,{"$f":"IF($A23=\"\",\"\",IF($H$3=\"YES\",VLOOKUP(OFFSET(A23,M22,0),Calendar!$A$2:$C$10000,3,FALSE),1))","v":1},{"$f":"IF(A23=\"\",\"\",IF(VLOOKUP(A22,Calendar!A:E,5,FALSE)=0,\"\",CEILING(K22*CEILING(MAX(OFFSET(J22,M22,0),OFFSET(I22,M22,0)),roundto),roundto)+add_margin))","v":2840000},{"$f":"IF(INDIRECT(\"Calendar!E\"&MATCH($A22,Calendar!A:A,0)-1),0,IF(INDIRECT(\"Calendar!E\"&MATCH($A22,Calendar!A:A,0)-2),1,2))","v":0}]
["2025-09-16",1102410,548039,{"$f":"IF(B23>minIMSM,B23,\"\")","v":1102410},548039,848978.56279069767,537321.84085751954,215,1816157.8763342327,2783016,{"$f":"IF($A24=\"\",\"\",IF($H$3=\"YES\",VLOOKUP(OFFSET(A24,M23,0),Calendar!$A$2:$C$10000,3,FALSE),1))","v":1},{"$f":"IF(A24=\"\",\"\",IF(VLOOKUP(A23,Calendar!A:E,5,FALSE)=0,\"\",CEILING(K23*CEILING(MAX(OFFSET(J23,M23,0),OFFSET(I23,M23,0)),roundto),roundto)+add_margin))","v":2840000},{"$f":"IF(INDIRECT(\"Calendar!E\"&MATCH($A23,Calendar!A:A,0)-1),0,IF(INDIRECT(\"Calendar!E\"&MATCH($A23,Calendar!A:A,0)-2),1,2))","v":0}]
["2025-09-15",453305,19400,453305,19400,851415.93488372094,531557.51870538178,215,1808219.468553408,2783016,{"$f":"IF($A25=\"\",\"\",IF($H$3=\"YES\",VLOOKUP(OFFSET(A25,M24,0),Calendar!$A$2:$C$10000,3,FALSE),1))","v":1},{"$f":"IF(A25=\"\",\"\",IF(VLOOKUP(A24,Calendar!A:E,5,FALSE)=0,\"\",CEILING(K24*CEILING(MAX(OFFSET(J24,M24,0),OFFSET(I24,M24,0)),roundto),roundto)+add_margin))","v":2840000},{"$f":"IF(INDIRECT(\"Calendar!E\"&MATCH($A24,Calendar!A:A,0)-1),0,IF(INDIRECT(\"Calendar!E\"&MATCH($A24,Calendar!A:A,0)-2),1,2))","v":0}]
["2025-09-12",293583,388371,293583,388371,850887.40930232557,533607.52574178728,215,1811380.9556375425,2783016,{"$f":"IF($A26=\"\",\"\",IF($H$3=\"YES\",VLOOKUP(OFFSET(A26,M25,0),Calendar!$A$2:$C$10000,3,FALSE),1))","v":1},{"$f":"IF(A26=\"\",\"\",IF(VLOOKUP(A25,Calendar!A:E,5,FALSE)=0,\"\",CEILING(K25*CEILING(MAX(OFFSET(J25,M25,0),OFFSET(I25,M25,0)),roundto),roundto)+add_margin))","v":2840000},{"$f":"IF(INDIRECT(\"Calendar!E\"&MATCH($A25,Calendar!A:A,0)-1),0,IF(INDIRECT(\"Calendar!E\"&MATCH($A25,Calendar!A:A,0)-2),1,2))","v":0}]
["2025-09-11",651970,432616,651970,432616,850236.93488372094,535345.08796060295,215,1813858.0932128062,2783016,{"$f":"IF($A27=\"\",\"\",IF($H$3=\"YES\",VLOOKUP(OFFSET(A27,M26,0),Calendar!$A$2:$C$10000,3,FALSE),1))","v":1},{"$f":"IF(A27=\"\",\"\",IF(VLOOKUP(A26,Calendar!A:E,5,FALSE)=0,\"\",CEILING(K26*CEILING(MAX(OFFSET(J26,M26,0),OFFSET(I26,M26,0)),roundto),roundto)+add_margin))","v":2840000},{"$f":"IF(INDIRECT(\"Calendar!E\"&MATCH($A26,Calendar!A:A,0)-1),0,IF(INDIRECT(\"Calendar!E\"&MATCH($A26,Calendar!A:A,0)-2),1,2))","v":0}]
["2025-09-10",862497,588877,862497,588877,845683.01860465121,537015.61022572138,215,1812311.1170109496,2783016,{"$f":"IF($A28=\"\",\"\",IF($H$3=\"YES\",VLOOKUP(OFFSET(A28,M27,0),Calendar!$A$2:$C$10000,3,FALSE),1))","v":1},{"$f":"IF(A28=\"\",\"\",IF(VLOOKUP(A27,Calendar!A:E,5,FALSE)=0,\"\",CEILING(K27*CEILING(MAX(OFFSET(J27,M27,0),OFFSET(I27,M27,0)),roundto),roundto)+add_margin))","v":2840000},{"$f":"IF(INDIRECT(\"Calendar!E\"&MATCH($A27,Calendar!A:A,0)-1),0,IF(INDIRECT(\"Calendar!E\"&MATCH($A27,Calendar!A:A,0)-2),1,2))","v":0}]
["2025-09-09",1253310,741357,1253310,741357,843432.72558139532,540121.50798905781,215,1815651.4399616993,2783016,{"$f":"IF($A29=\"\",\"\",IF($H$3=\"YES\",VLOOKUP(OFFSET(A29,M28,0),Calendar!$A$2:$C$10000,3,FALSE),1))","v":1},{"$f":"IF(A29=\"\",\"\",IF(VLOOKUP(A28,Calendar!A:E,5,FALSE)=0,\"\",CEILING(K28*CEILING(MAX(OFFSET(J28,M28,0),OFFSET(I28,M28,0)),roundto),roundto)+add_margin))","v":2840000},{"$f":"IF(INDIRECT(\"Calendar!E\"&MATCH($A28,Calendar!A:A,0)-1),0,IF(INDIRECT(\"Calendar!E\"&MATCH($A28,Calendar!A:A,0)-2),1,2))","v":0}]
["2025-09-08",1123881,533563,1123881,533563,845044.54883720935,542871.49112467642,215,1822213.2328616269,2783016,{"$f":"IF($A30=\"\",\"\",IF($H$3=\"YES\",VLOOKUP(OFFSET(A30,M29,0),Calendar!$A$2:$C$10000,3,FALSE),1))","v":1},{"$f":"IF(A30=\"\",\"\",IF(VLOOKUP(A29,Calendar!A:E,5,FALSE)=0,\"\",CEILING(K29*CEILING(MAX(OFFSET(J29,M29,0),OFFSET(I29,M29,0)),roundto),roundto)+add_margin))","v":2840000},{"$f":"IF(INDIRECT(\"Calendar!E\"&MATCH($A29,Calendar!A:A,0)-1),0,IF(INDIRECT(\"Calendar!E\"&MATCH($A29,Calendar!A:A,0)-2),1,2))","v":0}]
["2025-09-05",695014,474965,695014,474965,843933.88837209297,545118.2309128975,215,1825146.7040153085,2783016,{"$f":"IF($A31=\"\",\"\",IF($H$3=\"YES\",VLOOKUP(OFFSET(A31,M30,0),Calendar!$A$2:$C$10000,3,FALSE),1))","v":1},{"$f":"IF(A31=\"\",\"\",IF(VLOOKUP(A30,Calendar!A:E,5,FALSE)=0,\"\",CEILING(K30*CEILING(MAX(OFFSET(J30,M30,0),OFFSET(I30,M30,0)),roundto),roundto)+add_margin))","v":2840000},{"$f":"IF(INDIRECT(\"Calendar!E\"&MATCH($A30,Calendar!A:A,0)-1),0,IF(INDIRECT(\"Calendar!E\"&MATCH($A30,Calendar!A:A,0)-2),1,2))","v":0}]
["2025-09-04",884049,587569,884049,587569,843160.63255813951,546527.61727552593,215,1826910.3436540863,2783016,{"$f":"IF($A32=\"\",\"\",IF($H$3=\"YES\",VLOOKUP(OFFSET(A32,M31,0),Calendar!$A$2:$C$10000,3,FALSE),1))","v":1},{"$f":"IF(A32=\"\",\"\",IF(VLOOKUP(A31,Calendar!A:E,5,FALSE)=0,\"\",CEILING(K31*CEILING(MAX(OFFSET(J31,M31,0),OFFSET(I31,M31,0)),roundto),roundto)+add_margin))","v":2840000},{"$f":"IF(INDIRECT(\"Calendar!E\"&MATCH($A31,Calendar!A:A,0)-1),0,IF(INDIRECT(\"Calendar!E\"&MATCH($A31,Calendar!A:A,0)-2),1,2))","v":0}]
["2025-09-03",1144105,715273,1144105,715273,840939.96744186047,544389.04538012017,215,1820840.2491260767,2783016,{"$f":"IF($A33=\"\",\"\",IF($H$3=\"YES\",VLOOKUP(OFFSET(A33,M32,0),Calendar!$A$2:$C$10000,3,FALSE),1))","v":1},{"$f":"IF(A33=\"\",\"\",IF(VLOOKUP(A32,Calendar!A:E,5,FALSE)=0,\"\",CEILING(K32*CEILING(MAX(OFFSET(J32,M32,0),OFFSET(I32,M32,0)),roundto),roundto)+add_margin))","v":2840000},{"$f":"IF(INDIRECT(\"Calendar!E\"&MATCH($A32,Calendar!A:A,0)-1),0,IF(INDIRECT(\"Calendar!E\"&MATCH($A32,Calendar!A:A,0)-2),1,2))","v":0}]
["2025-09-02",1575066,1063504,1575066,1063504,837869.6744186047,548696.37929159775,215,1825523.1571434806,3581795.2,{"$f":"IF($A34=\"\",\"\",IF($H$3=\"YES\",VLOOKUP(OFFSET(A34,M33,0),Calendar!$A$2:$C$10000,3,FALSE),1))","v":1},{"$f":"IF(A34=\"\",\"\",IF(VLOOKUP(A33,Calendar!A:E,5,FALSE)=0,\"\",CEILING(K33*CEILING(MAX(OFFSET(J33,M33,0),OFFSET(I33,M33,0)),roundto),roundto)+add_margin))","v":3640000},{"$f":"IF(INDIRECT(\"Calendar!E\"&MATCH($A33,Calendar!A:A,0)-1),0,IF(INDIRECT(\"Calendar!E\"&MATCH($A33,Calendar!A:A,0)-2),1,2))","v":0}]
["2025-09-01",1217077,310029,1217077,310029,840061.5953488372,549364.10450215847,215,1828916.9834527224,3581795.2,{"$f":"IF($A35=\"\",\"\",IF($H$3=\"YES\",VLOOKUP(OFFSET(A35,M34,0),Calendar!$A$2:$C$10000,3,FALSE),1))","v":1},{"$f":"IF(A35=\"\",\"\",IF(VLOOKUP(A34,Calendar!A:E,5,FALSE)=0,\"\",CEILING(K34*CEILING(MAX(OFFSET(J34,M34,0),OFFSET(I34,M34,0)),roundto),roundto)+add_margin))","v":3640000},{"$f":"IF(INDIRECT(\"Calendar!E\"&MATCH($A34,Calendar!A:A,0)-1),0,IF(INDIRECT(\"Calendar!E\"&MATCH($A34,Calendar!A:A,0)-2),1,2))","v":0}]
["2025-08-29",410225,301574,410225,301574,839145.61860465119,550507.1870122212,215,1830058.5552266494,3581795.2,{"$f":"IF($A36=\"\",\"\",IF($H$3=\"YES\",VLOOKUP(OFFSET(A36,M35,0),Calendar!$A$2:$C$10000,3,FALSE),1))","v":1},{"$f":"IF(A36=\"\",\"\",IF(VLOOKUP(A35,Calendar!A:E,5,FALSE)=0,\"\",CEILING(K35*CEILING(MAX(OFFSET(J35,M35,0),OFFSET(I35,M35,0)),roundto),roundto)+add_margin))","v":3640000},{"$f":"IF(INDIRECT(\"Calendar!E\"&MATCH($A35,Calendar!A:A,0)-1),0,IF(INDIRECT(\"Calendar!E\"&MATCH($A35,Calendar!A:A,0)-2),1,2))","v":0}]
["2025-08-28",626020,483621,626020,483621,836444.35348837206,554846.79771223827,215,1835168.5893704011,3581795.2,{"$f":"IF($A37=\"\",\"\",IF($H$3=\"YES\",VLOOKUP(OFFSET(A37,M36,0),Calendar!$A$2:$C$10000,3,FALSE),1))","v":1},{"$f":"IF(A37=\"\",\"\",IF(VLOOKUP(A36,Calendar!A:E,5,FALSE)=0,\"\",CEILING(K36*CEILING(MAX(OFFSET(J36,M36,0),OFFSET(I36,M36,0)),roundto),roundto)+add_margin))","v":3640000},{"$f":"IF(INDIRECT(\"Calendar!E\"&MATCH($A36,Calendar!A:A,0)-1),0,IF(INDIRECT(\"Calendar!E\"&MATCH($A36,Calendar!A:A,0)-2),1,2))","v":0}]
["2025-08-27",580668,333994,580668,333994,835488.02790697676,555965.04421545996,215,1836225.1074948045,3581795.2,{"$f":"IF($A38=\"\",\"\",IF($H$3=\"YES\",VLOOKUP(OFFSET(A38,M37,0),Calendar!$A$2:$C$10000,3,FALSE),1))","v":1},{"$f":"IF(A38=\"\",\"\",IF(VLOOKUP(A37,Calendar!A:E,5,FALSE)=0,\"\",CEILING(K37*CEILING(MAX(OFFSET(J37,M37,0),OFFSET(I37,M37,0)),roundto),roundto)+add_margin))","v":3640000},{"$f":"IF(INDIRECT(\"Calendar!E\"&MATCH($A37,Calendar!A:A,0)-1),0,IF(INDIRECT(\"Calendar!E\"&MATCH($A37,Calendar!A:A,0)-2),1,2))","v":0}]
["2025-08-26",743322,628866,743322,628866,832089.69767441857,562266.93738186522,215,1844170.184961776,3581795.2,{"$f":"IF($A39=\"\",\"\",IF($H$3=\"YES\",VLOOKUP(OFFSET(A39,M38,0),Calendar!$A$2:$C$10000,3,FALSE),1))","v":1},{"$f":"IF(A39=\"\",\"\",IF(VLOOKUP(A38,Calendar!A:E,5,FALSE)=0,\"\",CEILING(K38*CEILING(MAX(OFFSET(J38,M38,0),OFFSET(I38,M38,0)),roundto),roundto)+add_margin))","v":3640000},{"$f":"IF(INDIRECT(\"Calendar!E\"&MATCH($A38,Calendar!A:A,0)-1),0,IF(INDIRECT(\"Calendar!E\"&MATCH($A38,Calendar!A:A,0)-2),1,2))","v":0}]
["2025-08-25",656513,254069,656513,254069,831369.4790697674,563624.58238725213,215,1845893.7273668214,3581795.2,{"$f":"IF($A40=\"\",\"\",IF($H$3=\"YES\",VLOOKUP(OFFSET(A40,M39,0),Calendar!$A$2:$C$10000,3,FALSE),1))","v":1},{"$f":"IF(A40=\"\",\"\",IF(VLOOKUP(A39,Calendar!A:E,5,FALSE)=0,\"\",CEILING(K39*CEILING(MAX(OFFSET(J39,M39,0),OFFSET(I39,M39,0)),roundto),roundto)+add_margin))","v":3640000},{"$f":"IF(INDIRECT(\"Calendar!E\"&MATCH($A39,Calendar!A:A,0)-1),0,IF(INDIRECT(\"Calendar!E\"&MATCH($A39,Calendar!A:A,0)-2),1,2))","v":0}]
["2025-08-22",248557,144410,248557,144410,831170.25581395347,563926.23370681005,215,1846237.4764862116,3581795.2,{"$f":"IF($A41=\"\",\"\",IF($H$3=\"YES\",VLOOKUP(OFFSET(A41,M40,0),Calendar!$A$2:$C$10000,3,FALSE),1))","v":1},{"$f":"IF(A41=\"\",\"\",IF(VLOOKUP(A40,Calendar!A:E,5,FALSE)=0,\"\",CEILING(K40*CEILING(MAX(OFFSET(J40,M40,0),OFFSET(I40,M40,0)),roundto),roundto)+add_margin))","v":3640000},{"$f":"IF(INDIRECT(\"Calendar!E\"&MATCH($A40,Calendar!A:A,0)-1),0,IF(INDIRECT(\"Calendar!E\"&MATCH($A40,Calendar!A:A,0)-2),1,2))","v":0}]
{"$rows_left_out":471}
{"sheet":"Parameter","index":1,"n_rows":9,"n_cols":2,"rows_kept":9,"cut":false,"hidden":false,"merged":[]}
[]
["Window Size Statistic",250]
["Window Size Maximum",30]
["EWMA Factor",0.99]
["alpha",1.8]
["beta",1.6]
["minIMSM in EUR",0]
["roundto",10000]
["Additional Margin in EUR",50000]

{"sheet":"Calendar","index":2,"n_rows":1827,"n_cols":7,"rows_kept":1827,"cut":false,"hidden":false,"merged":[]}
["ECC Calendar ","index","Holiday Adjustment Scaling Factor","Flag Weekday","ECC Business Day","Rows Until Next Business Day","Days Until Business Day After Next BD"]
["2021-01-01",{"$f":"ROW(A2)-1","v":1},{"$f":"1+0.3*MAX(G2-4,0)","v":1},null,0,{"$f":"IF($E2=1,MATCH(1,INDIRECT(\"$E$\"&ROW($A2)+1&\":$E$2598\"),0),0)","v":0},{"$f":"IF($E2=1,INDIRECT(\"$A$\"&ROW($A2)+MATCH(1,INDIRECT(\"$E$\"&ROW($A2)+1+$F2&\":$E$2598\"),0)+$F2)-$A2,0)","v":0}]
["2021-01-04",{"$f":"ROW(A3)-1","v":2},{"$f":"1+0.3*MAX(G3-4,0)","v":1},{"$f":"IF(ABS(WEEKDAY($A3)-4)<=1,1,0)","v":0},1,{"$f":"IF($E3=1,MATCH(1,INDIRECT(\"$E$\"&ROW($A3)+1&\":$E$2598\"),0),0)","v":1},2]
["2021-01-05",3,1,1,1,1,2]
["2021-01-06",4,1,1,1,1,2]
["2021-01-07",5,1,1,1,1,4]
["2021-01-08",6,1,0,1,1,4]
["2021-01-11",7,1,0,1,1,2]
["2021-01-12",8,1,1,1,1,2]
["2021-01-13",9,1,1,1,1,2]
["2021-01-14",10,1,1,1,1,4]
["2021-01-15",11,1,0,1,1,4]
["2021-01-18",12,1,0,1,1,2]
["2021-01-19",13,1,1,1,1,2]
["2021-01-20",14,1,1,1,1,2]
["2021-01-21",15,1,1,1,1,4]
["2021-01-22",16,1,0,1,1,4]
["2021-01-25",17,1,0,1,1,2]
["2021-01-26",18,1,1,1,1,2]
["2021-01-27",19,1,1,1,1,2]
["2021-01-28",20,1,1,1,1,4]
["2021-01-29",21,1,0,1,1,4]
["2021-02-01",22,1,0,1,1,2]
["2021-02-02",23,1,1,1,1,2]
["2021-02-03",24,1,1,1,1,2]
["2021-02-04",25,1,1,1,1,4]
["2021-02-05",26,1,0,1,1,4]
["2021-02-08",27,1,0,1,1,2]
["2021-02-09",28,1,1,1,1,2]
["2021-02-10",29,1,1,1,1,2]
["2021-02-11",30,1,1,1,1,4]
["2021-02-12",31,1,0,1,1,4]
["2021-02-15",32,1,0,1,1,2]
["2021-02-16",33,1,1,1,1,2]
["2021-02-17",34,1,1,1,1,2]
["2021-02-18",35,1,1,1,1,4]
["2021-02-19",36,1,0,1,1,4]
["2021-02-22",37,1,0,1,1,2]
["2021-02-23",38,1,1,1,1,2]
["2021-02-24",39,1,1,1,1,2]
{"$rows_left_out":1788}
{"sheet":"Disclaimer","index":3,"n_rows":8,"n_cols":4,"rows_kept":8,"cut":false,"hidden":false,"merged":[[4,3,4,6],[5,3,5,4],[7,3,9,21]]}
[]
[]
[]
[]
[null,null,null,"Disclaimer"]
[null,null,null,"last update: 2025-03-06"]
[]
[null,null,null,"This tool is only a service for recalculating the Initial Margin Spot Market.\n Although the tool was constructed with greatest diligence, errors, rounding errors and therefore deviations from the productive process cannot be excluded. In cases of doubt, the calculated value of the IMSM programm shall prevail. The disclaimer at\nhttp://www.ecc.de/ecc-en/extras/disclaimer shall apply to the use of this tool as well.\n"]